Minor change to fix API discrepancy

35 jobs for lbm_pack_infos in 270 minutes and 37 seconds (queued for 2 seconds)
latest
Name Stage Failure
failed
intel_19_hybrid_dbg Test
compilation aborted for ../../../../apps/benchmarks/CouetteFlow/CouetteFlow.cpp (code 1)
make[2]: *** [apps/benchmarks/CouetteFlow/CMakeFiles/CouetteFlow.dir/CouetteFlow.cpp.o] Error 1
make[1]: *** [apps/benchmarks/CouetteFlow/CMakeFiles/CouetteFlow.dir/all] Error 2
apps/benchmarks/CouetteFlow/CMakeFiles/CouetteFlow.dir/build.make:62: recipe for target 'apps/benchmarks/CouetteFlow/CMakeFiles/CouetteFlow.dir/CouetteFlow.cpp.o' failed
CMakeFiles/Makefile2:18333: recipe for target 'apps/benchmarks/CouetteFlow/CMakeFiles/CouetteFlow.dir/all' failed
Makefile:140: recipe for target 'all' failed
make: *** [all] Error 2
Cleaning up file based variables
ERROR: Job failed: exit code 1