gracefully failing von vectortype

8 jobs for master in 21 minutes and 51 seconds (queued for 49 seconds)
latest
Name Stage Failure
failed
pycodegen-integration Test
FAILED pystencils_tests/test_datahandling_parallel.py::test_gpu - TypeError: ...
FAILED pystencils_tests/test_datahandling_parallel.py::test_kernel - TypeErro...
FAILED pystencils_tests/test_datahandling_parallel.py::test_vtk_output - Type...
FAILED pystencils_tests/test_datahandling_parallel.py::test_block_iteration
FAILED pystencils_tests/test_datahandling_parallel.py::test_getter_setter - T...
FAILED pystencils_tests/test_small_block_benchmark.ipynb::test_small_block_benchmark.ipynb
= 9 failed, 417 passed, 8 xfailed, 6 xpassed, 76 warnings in 113.29s (0:01:53) =
Cleaning up file based variables
ERROR: Job failed: exit code 1