Increasing the minimal python version

28 jobs for python_3.8 in 55 minutes and 12 seconds (queued for 2 seconds)
Name Stage Failure
failed
minimal-sympy-master Test
Removing test-report/

Skipping Git submodules setup
Executing "step_script" stage of the job script
Using docker image sha256:59dc42ca57bcbaa57317260bbfade4a5e7368d8dee10cefcb45edf82a3b24512 for i10git.cs.fau.de:5005/pycodegen/pycodegen/minimal_conda with digest i10git.cs.fau.de:5005/pycodegen/pycodegen/minimal_conda@sha256:1ee3661ec7adcf7b7351e5b20251a6b1f7881aa1ebdedd229d243fa0e8a08bc2 ...
$ python -m pip install --upgrade git+https://github.com/sympy/sympy.git
/opt/conda/bin/python: No module named pip
Cleaning up file based variables
ERROR: Job failed: exit code 1
failed
latest-python Test
FAILED pystencils_tests/test_kerncraft_coupling.py::test_3d_7pt - TypeError: ...
FAILED pystencils_tests/test_kerncraft_coupling.py::test_3d_7pt_osaca - TypeE...
== 3 failed, 403 passed, 106 skipped, 7014771 warnings in 2376.81s (0:39:36) ===
Uploading artifacts for failed job
Uploading artifacts...
report.xml: found 1 matching files and directories

Uploading artifacts as "junit" to coordinator... ok
id=625505 responseStatus=201 Created token=Tqts7VUM
Cleaning up file based variables
ERROR: Job failed: exit code 1
failed
tests-and-coverage Pretest
Uploading artifacts as "archive" to coordinator... ok  id=625501 responseStatus=201 Created token=b6GSFcH_
Uploading artifacts...
WARNING: coverage.xml: no matching files
ERROR: No files to upload
Uploading artifacts...
report.xml: found 1 matching files and directories

Uploading artifacts as "junit" to coordinator... ok
id=625501 responseStatus=201 Created token=b6GSFcH_
Cleaning up file based variables
ERROR: Job failed: exit code 1
failed
pycodegen-integration Test
FAILED pystencils_tests/test_kerncraft_coupling.py::test_2d_5pt - TypeError: ...
FAILED pystencils_tests/test_kerncraft_coupling.py::test_3d_7pt - TypeError: ...
=== 6 failed, 541 passed, 2 skipped, 7014685 warnings in 1077.35s (0:17:57) ====
Uploading artifacts for failed job
Uploading artifacts...
pycodegen/*/report.xml: found 1 matching files and directories

Uploading artifacts as "junit" to coordinator... ok
id=625498 responseStatus=201 Created token=wEfa_iiL
Cleaning up file based variables
ERROR: Job failed: exit code 1