Introducing backwards compatibility for `create_data_handling`

13 jobs for create_kernel_api in 136 minutes and 26 seconds (queued for 2 seconds)
latest
Status Job ID Name Coverage
  Pretest
passed #631122
docker
flake8-lint

00:04:26

passed #631121
cuda docker
minimal-conda

00:01:14

passed #631120
AVX cuda11 docker
tests-and-coverage

00:43:43

 
  Test
passed #631126
AVX docker
arm64v8

00:04:29

passed #631128
AVX docker
arm64v9

00:16:56

passed #631132
docker
build-documentation

00:03:24

passed #631123
AVX docker
latest-python

00:50:40

passed #631130
cuda docker
minimal-sympy-master

00:02:01

passed #631124
win
minimal-windows

00:13:43

passed #631127
AVX docker
ppc64le

00:06:30

failed #631131
AVX cuda11 docker allowed to fail manual
pycodegen-integration

00:42:01

passed #631129
AVX docker
riscv64

00:04:31

passed #631125
AVX cuda11 docker
ubuntu

00:02:15

 
Name Stage Failure
failed
pycodegen-integration Test
FAILED lbmpy_tests/phasefield/test_n_phase_penaltyterm_model.ipynb::lbmpy_tests/phasefield/test_n_phase_penaltyterm_model.ipynb
FAILED lbmpy_tests/phasefield_allen_cahn/test_phase_field_allen_cahn_2d.ipynb::lbmpy_tests/phasefield_allen_cahn/test_phase_field_allen_cahn_2d.ipynb
FAILED lbmpy_tests/centeredcumulant/test_flow_around_sphere.py::test_flow_around_sphere_short[True-D3Q27]
========== 283 failed, 358 passed, 672 warnings in 293.23s (0:04:53) ===========
Uploading artifacts for failed job
Uploading artifacts...
pycodegen/*/report.xml: found 2 matching files and directories

Uploading artifacts as "junit" to coordinator... ok
id=631131 responseStatus=201 Created token=o31EkVQ8
Cleaning up file based variables
ERROR: Job failed: exit code 1