Removed OpenCL parallel Datahandling test case

10 jobs for Remove_Parallel_OpenCL_test in 39 minutes and 25 seconds (queued for 2 seconds)
Name Stage Failure
failed
pycodegen-integration Test
tests/field/CMakeFiles/CodegenJacobiCPU.dir/build.make:120: recipe for target 'tests/field/CodegenJacobiCPU' failed
make[3]: *** [tests/field/CodegenJacobiCPU] Error 1
CMakeFiles/Makefile2:5742: recipe for target 'tests/field/CMakeFiles/CodegenJacobiCPU.dir/all' failed
make[2]: *** [tests/field/CMakeFiles/CodegenJacobiCPU.dir/all] Error 2
CMakeFiles/Makefile2:5749: recipe for target 'tests/field/CMakeFiles/CodegenJacobiCPU.dir/rule' failed
make[1]: *** [tests/field/CMakeFiles/CodegenJacobiCPU.dir/rule] Error 2
Makefile:1982: recipe for target 'CodegenJacobiCPU' failed
make: *** [CodegenJacobiCPU] Error 2
ERROR: Job failed: exit code 1