Removed Trace function from force test

8 jobs for FIX_Boundary_kwargs in 20 minutes and 34 seconds (queued for 2 seconds)
Status Job ID Name Coverage
  Test
passed #493970
cuda11 docker
build-documentation

00:00:41

passed #493969
cuda11 docker
flake8-lint

00:00:07

passed #493967
docker
minimal-conda

00:00:43

passed #493965
win
minimal-windows

00:02:26

failed #494044
docker cuda11 AVX manual
pycodegen-integration

00:03:34

passed #493964
AVX cuda11 docker
tests-and-coverage

00:07:20

passed #493966
cuda11 docker
ubuntu

00:14:23

failed #493968
AVX cuda11 docker manual
pycodegen-integration

00:03:37

 
Name Stage Failure
failed
pycodegen-integration Test
Files only specified in CMake ['LbCodeGenerationExample_UBB.cpp', 'LbCodeGenerationExample_NoSlip.cpp', 'LbCodeGenerationExample_UBB.h', 'LbCodeGenerationExample_NoSlip.h']

make[3]: *** [tests/lbm/CMakeFiles/LbCodeGenerationExampleGenerated.dir/build.make:62: tests/lbm/default_codegen/LbCodeGenerationExample_LatticeModel.cpp] Error 1
make[3]: *** Deleting file 'tests/lbm/default_codegen/LbCodeGenerationExample_LatticeModel.cpp'
make[2]: *** [CMakeFiles/Makefile2:8036: tests/lbm/CMakeFiles/LbCodeGenerationExampleGenerated.dir/all] Error 2
make[1]: *** [CMakeFiles/Makefile2:8119: tests/lbm/CMakeFiles/LbCodeGenerationExample.dir/rule] Error 2
make: *** [Makefile:2502: LbCodeGenerationExample] Error 2
Cleaning up file based variables
ERROR: Job failed: exit code 1