Add periodicity to sparse mapping.

8 jobs for feature/try in 8 minutes and 10 seconds (queued for 2 seconds)
Status Job ID Name Coverage
  Test
failed #611111
cuda11 docker
build-documentation

00:00:05

failed #611110
cuda11 docker
flake8-lint

00:00:05

failed #611105
AVX docker
latest-python

00:06:02

passed #611108
docker
minimal-conda

00:00:24

failed #611106
win
minimal-windows

00:08:09

manual #611109
AVX cuda11 docker allowed to fail manual
pycodegen-integration
failed #611104
AVX cuda11 docker
tests-and-coverage

00:00:05

failed #611107
cuda11 docker
ubuntu

00:04:28

 
Name Stage Failure
failed
minimal-windows Test
ERROR lbmpy/session.py - ModuleNotFoundError: No module named 'pystencils.sym...
ERROR lbmpy_tests/test_force.py - ModuleNotFoundError: No module named 'pyste...
ERROR lbmpy_tests/test_force.py
ERROR lbmpy_tests/test_force.py - ModuleNotFoundError: No module named 'pyste...
ERROR lbmpy_tests/test_force.py - ModuleNotFoundError: No module named 'pyste...
ERROR lbmpy_tests/test_force.py - ModuleNotFoundError: No module named 'pyste...
===== 346 passed, 20 skipped, 13 warnings, 9 errors in 413.62s (0:06:53) ======
Cleaning up file based variables
ERROR: Job failed: Process exited with status 1
failed
latest-python Test
ERROR lbmpy_tests/test_force.py - ModuleNotFoundError: No module named 'pyste...
ERROR lbmpy_tests/test_force.py - ModuleNotFoundError: No module named 'pyste...
= 30 failed, 349 passed, 25 skipped, 44 warnings, 33 errors in 259.01s (0:04:19) =
Uploading artifacts for failed job
Uploading artifacts...
report.xml: found 1 matching files and directories

Uploading artifacts as "junit" to coordinator... ok
id=611105 responseStatus=201 Created token=hwejGyso
Cleaning up file based variables
ERROR: Job failed: exit code 1
failed
ubuntu Test

-- Docs: http://doc.pytest.org/en/latest/warnings.html
=== 36 failed, 365 passed, 3 skipped, 3 warnings, 25 error in 230.64 seconds ===
Uploading artifacts for failed job
Uploading artifacts...
report.xml: found 1 matching files and directories

Uploading artifacts as "junit" to coordinator... ok
id=611107 responseStatus=201 Created token=by86fsct
Cleaning up file based variables
ERROR: Job failed: exit code 1
failed
build-documentation Test There has been a runner system failure, please try again
Fetching changes...
Reinitialized existing Git repository in /builds/holzer/lbmpy/.git/
Checking out 71e5fd86 as feature/try...

Skipping Git submodules setup
Executing "step_script" stage of the job script
Using docker image sha256:0cf518ae64d2ef329efc1fe5219e1d57f1a1937685e29c7a6017587d72145700 for i10git.cs.fau.de:5005/pycodegen/pycodegen/full with digest i10git.cs.fau.de:5005/pycodegen/pycodegen/full@sha256:b1adfa7aa1a411acb69fdbd6e56ddd1d33e0f9be2a4a4f183a81a413d3ae1e29 ...
Cleaning up file based variables
ERROR: Job failed (system failure): Error response from daemon: OCI runtime create failed: container_linux.go:380: starting container process caused: process_linux.go:545: container init caused: Running hook #1:: error running hook: exit status 1, stdout: , stderr: nvidia-container-cli: initialization error: nvml error: driver/library version mismatch: unknown (exec.go:57:0s)
failed
flake8-lint Test There has been a runner system failure, please try again
Fetching changes...
Reinitialized existing Git repository in /builds/holzer/lbmpy/.git/
Checking out 71e5fd86 as feature/try...

Skipping Git submodules setup
Executing "step_script" stage of the job script
Using docker image sha256:0cf518ae64d2ef329efc1fe5219e1d57f1a1937685e29c7a6017587d72145700 for i10git.cs.fau.de:5005/pycodegen/pycodegen/full with digest i10git.cs.fau.de:5005/pycodegen/pycodegen/full@sha256:b1adfa7aa1a411acb69fdbd6e56ddd1d33e0f9be2a4a4f183a81a413d3ae1e29 ...
Cleaning up file based variables
ERROR: Job failed (system failure): Error response from daemon: OCI runtime create failed: container_linux.go:380: starting container process caused: process_linux.go:545: container init caused: Running hook #1:: error running hook: exit status 1, stdout: , stderr: nvidia-container-cli: initialization error: nvml error: driver/library version mismatch: unknown (exec.go:57:0s)
failed
tests-and-coverage Test There has been a runner system failure, please try again
ERROR: No files to upload                          
Uploading artifacts...
WARNING: coverage.xml: no matching files
ERROR: No files to upload
Uploading artifacts...
WARNING: report.xml: no matching files
ERROR: No files to upload
Cleaning up file based variables
ERROR: Job failed (system failure): Error response from daemon: OCI runtime create failed: container_linux.go:380: starting container process caused: process_linux.go:545: container init caused: Running hook #1:: error running hook: exit status 1, stdout: , stderr: nvidia-container-cli: initialization error: nvml error: driver/library version mismatch: unknown (exec.go:57:0s)