merge master

9 jobs for RemoveEntropicSRT in 138 minutes and 50 seconds (queued for 1 minute and 26 seconds)
Name Stage Failure
failed
minimal-windows Test
35.20s call     lbmpy_tests/phasefield/test_phasefield.py::test_neumann_angle
35.12s call lbmpy_tests/centeredcumulant/test_equilibrium.py::test_equilibrium_pdfs[PdfsToCentralMomentsByMatrix-Stencil.D3Q27]
=========================== short test summary info ===========================
FAILED lbmpy_tests/test_entropic.py::test_entropic_methods[Method.TRT_KBC_N4]
FAILED lbmpy_tests/test_split_optimization.py::test_equivalence_short[setup0]
FAILED lbmpy_tests/test_vectorization.py::test_lbm_vectorization_short - Valu...
= 3 failed, 828 passed, 50 skipped, 317 deselected, 15 warnings in 5710.14s (1:35:10) =
Cleaning up project directory and file based variables
ERROR: Job failed: Process exited with status 1

failed
ubuntu Test
58.61s call     lbmpy_tests/test_central_moment_transform.py::test_backward_transform[Stencil.D3Q15-polynomial]
58.24s call lbmpy_tests/phasefield/test_liquid_lens_angles.ipynb::lbmpy_tests/phasefield/test_liquid_lens_angles.ipynb
======= 2 failed, 903 passed, 21 skipped, 136 warnings in 541.42 seconds =======
Uploading artifacts for failed job
Uploading artifacts...
report.xml: found 1 matching files and directories

Uploading artifacts as "junit" to coordinator... 201 Created
id=801767 responseStatus=201 Created token=qxF9gyFG
Cleaning up project directory and file based variables
ERROR: Job failed: exit code 1

failed
latest-python Test
FAILED lbmpy_tests/test_vectorization.py::test_lbm_vectorization_short - Valu...
FAILED lbmpy_tests/test_split_optimization.py::test_equivalence_short[setup0]
====== 2 failed, 861 passed, 60 skipped, 26 warnings in 565.21s (0:09:25) ======
Uploading artifacts for failed job
Uploading artifacts...
report.xml: found 1 matching files and directories

Uploading artifacts as "junit" to coordinator... 201 Created
id=801764 responseStatus=201 Created token=pSK9uttw
Cleaning up project directory and file based variables
ERROR: Job failed: exit code 1