test

9 jobs for FixSympy in 14 minutes and 58 seconds (queued for 3 seconds)
Status Job ID Name Coverage
  Test
passed #567135
docker
build-documentation

00:05:02

failed #567134
docker
flake8-lint

00:04:33

failed #567128
AVX docker
latest-python

00:05:21

failed #567131
cuda docker
minimal-conda

00:02:06

failed #567132
cuda docker allowed to fail
minimal-sympy-master

00:02:11

failed #567129
win
minimal-windows

00:14:54

manual #567133
AVX cuda11 docker allowed to fail manual
pycodegen-integration
failed #567127
AVX cuda11 docker
tests-and-coverage

00:10:50

failed #567130
AVX cuda11 docker
ubuntu

00:06:45

 
Name Stage Failure
failed
minimal-windows Test
FAILED pystencils_tests/test_vectorization_specific.py::test_vectorization_other[test_piecewise1-sse]
FAILED pystencils_tests/test_vectorization_specific.py::test_vectorization_other[test_piecewise2-sse]
FAILED pystencils_tests/test_vectorization_specific.py::test_vectorization_other[test_piecewise3-sse]
FAILED pystencils_tests/test_vectorization_specific.py::test_vectorization_other[test_logical_operators-sse]
FAILED pystencils_tests/test_vectorization_specific.py::test_vectorization_other[test_vectorised_pow-sse]
FAILED pystencils_tests/test_vectorization_specific.py::test_vectorization_other[test_vectorised_fast_approximations-sse]
= 199 failed, 162 passed, 98 skipped, 17 deselected, 2 warnings in 733.13s (0:12:13) =
Cleaning up file based variables
ERROR: Job failed: Process exited with status 1
failed
tests-and-coverage Test
        "input" should be a string, and stdout and stderr will be strings decoded
according to locale encoding, or by "encoding" if set. Text mode is
triggered by setting any of text, encoding, errors or universal_newlines.

The other arguments are the same as for the Popen constructor.
"""
if input is not None:
if kwargs.get('stdin') is not None:
Job's log exceeded limit of 4194304 bytes.
Job execution will continue but no more output will be collected.

failed
ubuntu Test
/usr/lib/python3.6/copy.py:180: in deepcopy
y = _reconstruct(x, memo, *rv)
/usr/lib/python3.6/copy.py:280: in _reconstruct
state = deepcopy(state, memo)
/usr/lib/python3.6/copy.py:150: in deepcopy
y = copier(x, memo)
/usr/lib/python3.6/copy.py:240: in _deepcopy_dict
y[deepcopy(key, memo)] = deepcopy(value, memo
Job's log exceeded limit of 4194304 bytes.
Job execution will continue but no more output will be collected.

failed
latest-python Test
FAILED pystencils_tests/test_fvm.py::test_advection_diffusion_3d[velocity25]
FAILED pystencils_tests/test_fvm.py::test_advection_diffusion_3d[velocity26]
===== 215 failed, 174 passed, 95 skipped, 39 warnings in 221.19s (0:03:41) =====
Uploading artifacts for failed job
Uploading artifacts...
report.xml: found 1 matching files and directories

Uploading artifacts as "junit" to coordinator... ok
id=567128 responseStatus=201 Created token=CBwykD6B
Cleaning up file based variables
ERROR: Job failed: exit code 1
failed
flake8-lint Test
Checking out 7873f215 as FixSympy...

Skipping Git submodules setup
Executing "step_script" stage of the job script
Using docker image sha256:0cf518ae64d2ef329efc1fe5219e1d57f1a1937685e29c7a6017587d72145700 for i10git.cs.fau.de:5005/pycodegen/pycodegen/full with digest i10git.cs.fau.de:5005/pycodegen/pycodegen/full@sha256:b1adfa7aa1a411acb69fdbd6e56ddd1d33e0f9be2a4a4f183a81a413d3ae1e29 ...
$ flake8 pystencils
pystencils/data_types.py:616:21: E241 multiple spaces after ','
Cleaning up file based variables
ERROR: Job failed: exit code 1
failed
minimal-sympy-master Test
  File "/builds/holzer/pystencils/pystencils/cpu/cpujit.py", line 504, in run_compile_step
subprocess.check_output(command, env=compile_environment, stderr=subprocess.STDOUT, shell=shell)
File "/opt/conda/lib/python3.8/subprocess.py", line 411, in check_output
return run(*popenargs, stdout=PIPE, timeout=timeout, check=True,
File "/opt/conda/lib/python3.8/subprocess.py", line 512, in run
raise CalledProcessError(retcode, process.args,
subprocess.CalledProcessError: Command '['g++', '-c', '-Ofast', '-DNDEBUG', '-fPIC', '-march=native', '-fopenmp', '-std=c++11', '-I/opt/conda/include/python3.8', '-I/builds/holzer/pystencils/pystencils/include', '-o', '/root/.cache/pystencils/objectcache/tmpzwyn0cyu', '/root/.cache/pystencils/objectcache/mod_b5b7139284b05140560ad1fd3b682d1734449f5e37b5c56c42f6200802e5ce65.cpp']' returned non-zero exit status 1.
Cleaning up file based variables
ERROR: Job failed: exit code 1
failed
minimal-conda Test
  File "/builds/holzer/pystencils/pystencils/cpu/cpujit.py", line 504, in run_compile_step
subprocess.check_output(command, env=compile_environment, stderr=subprocess.STDOUT, shell=shell)
File "/opt/conda/lib/python3.8/subprocess.py", line 411, in check_output
return run(*popenargs, stdout=PIPE, timeout=timeout, check=True,
File "/opt/conda/lib/python3.8/subprocess.py", line 512, in run
raise CalledProcessError(retcode, process.args,
subprocess.CalledProcessError: Command '['g++', '-c', '-Ofast', '-DNDEBUG', '-fPIC', '-march=native', '-fopenmp', '-std=c++11', '-I/opt/conda/include/python3.8', '-I/builds/holzer/pystencils/pystencils/include', '-o', '/root/.cache/pystencils/objectcache/tmp6yq4lmoo', '/root/.cache/pystencils/objectcache/mod_b5b7139284b05140560ad1fd3b682d1734449f5e37b5c56c42f6200802e5ce65.cpp']' returned non-zero exit status 1.
Cleaning up file based variables
ERROR: Job failed: exit code 1