revoke changes on flag field

13 jobs for int64 in 18 minutes and 2 seconds (queued for 5 seconds)
latest
Name Stage Failure
failed
flake8-lint Test There has been a runner system failure, please try again
Running with gitlab-runner 13.12.0 (7a6612da)
on i10swarm11 PmF6zCBg
Preparing the "docker" executor
Using Docker executor with image i10git.cs.fau.de:5005/pycodegen/pycodegen/full ...
Authenticating with credentials from /root/.docker/config.json
Pulling docker image i10git.cs.fau.de:5005/pycodegen/pycodegen/full ...
Using docker image sha256:0cf518ae64d2ef329efc1fe5219e1d57f1a1937685e29c7a6017587d72145700 for i10git.cs.fau.de:5005/pycodegen/pycodegen/full with digest i10git.cs.fau.de:5005/pycodegen/pycodegen/full@sha256:b1adfa7aa1a411acb69fdbd6e56ddd1d33e0f9be2a4a4f183a81a413d3ae1e29 ...
Preparing environment
ERROR: Job failed (system failure): prepare environment: Cannot connect to the Docker daemon at unix:///var/run/docker.sock. Is the docker daemon running? (docker.go:640:120s). Check https://docs.gitlab.com/runner/shells/index.html#shell-profile-loading for more information
failed
ubuntu Test

-- Docs: http://doc.pytest.org/en/latest/warnings.html
======= 9 failed, 421 passed, 17 skipped, 24 warnings in 121.87 seconds ========
Uploading artifacts for failed job
Uploading artifacts...
report.xml: found 1 matching files and directories

Uploading artifacts as "junit" to coordinator... ok
id=582128 responseStatus=201 Created token=WEUZwafu
Cleaning up file based variables
ERROR: Job failed: exit code 1
failed
minimal-windows Test
FAILED pystencils_tests/test_boundary.py::test_dirichlet[with_indices] - Valu...
FAILED pystencils_tests/test_boundary.py::test_dirichlet[False] - ValueError:...
FAILED pystencils_tests/test_boundary_indexlist_creation.py::test_equivalence_cython_python_version[False]
FAILED pystencils_tests/test_boundary_indexlist_creation.py::test_equivalence_cython_python_version[True]
FAILED pystencils_tests/test_boundary_indexlist_creation.py::test_equivalence_cell_idx_list_cython_python_version[False]
FAILED pystencils_tests/test_boundary_indexlist_creation.py::test_equivalence_cell_idx_list_cython_python_version[True]
= 8 failed, 348 passed, 111 skipped, 17 deselected, 20 warnings in 468.13s (0:07:48) =
Cleaning up file based variables
ERROR: Job failed: Process exited with status 1
failed
latest-python Test
FAILED pystencils_tests/test_boundary_indexlist_creation.py::test_equivalence_cell_idx_list_cython_python_version[False]
FAILED pystencils_tests/test_boundary.py::test_kernel_vs_copy_boundary - Valu...
===== 8 failed, 379 passed, 105 skipped, 129 warnings in 153.46s (0:02:33) =====
Uploading artifacts for failed job
Uploading artifacts...
report.xml: found 1 matching files and directories

Uploading artifacts as "junit" to coordinator... ok
id=582126 responseStatus=201 Created token=srQqEqvA
Cleaning up file based variables
ERROR: Job failed: exit code 1
failed
tests-and-coverage Test
Uploading artifacts as "archive" to coordinator... ok  id=582125 responseStatus=201 Created token=1bP6f-zd
Uploading artifacts...
WARNING: coverage.xml: no matching files
ERROR: No files to upload
Uploading artifacts...
report.xml: found 1 matching files and directories

Uploading artifacts as "junit" to coordinator... ok
id=582125 responseStatus=201 Created token=1bP6f-zd
Cleaning up file based variables
ERROR: Job failed: exit code 1