Fix squre root round off

13 jobs for RoundOffError in 34 minutes and 25 seconds (queued for 2 seconds)
Name Stage Failure
failed
pycodegen-integration Test
make[2]: *** [CMakeFiles/Makefile2:8495: tests/cuda/CMakeFiles/CodegenJacobiGPUGeneratedCudaJacobiKernel.dir/all] Error 2
make[1]: *** [CMakeFiles/Makefile2:8569: tests/cuda/CMakeFiles/CodegenJacobiGPU.dir/rule] Error 2
make: *** [Makefile:1683: CodegenJacobiGPU] Error 2
Uploading artifacts for failed job
Uploading artifacts...
pycodegen/*/report.xml: found 3 matching files and directories

Uploading artifacts as "junit" to coordinator... ok
id=709109 responseStatus=201 Created token=gvMVWysr
Cleaning up project directory and file based variables
ERROR: Job failed: exit code 1