Added generator for P2 epsilon operator with blending

23 jobs for drzisga/eps-P2 in 5 minutes and 23 seconds (queued for 2 minutes and 53 seconds)
latest
Name Stage Failure
failed
gcc_9_mpionly_dbg Pretest
/usr/bin/ld: ../../src/hyteg/libhyteg.a(P2ElementwiseOperator.cpp.o): in function `hyteg::P2Form_epsilon_32::evalQuadraturePoint3D(hyteg::PointND<double, 3ul> const&, hyteg::PointND<double, 3ul> const&, std::array<hyteg::PointND<double, 3ul>, 4ul> const&, hyteg::Matrix<double, 3ul, 3ul> const&, double, hyteg::Matrix<double, 10ul, 10ul>&) const':
P2ElementwiseOperator.cpp:(.text._ZNK5hyteg17P2Form_epsilon_3221evalQuadraturePoint3DERKNS_7PointNDIdLm3EEES4_RKSt5arrayIS2_Lm4EERKNS_6MatrixIdLm3ELm3EEEdRNS9_IdLm10ELm10EEE[_ZNK5hyteg17P2Form_epsilon_3221evalQuadraturePoint3DERKNS_7PointNDIdLm3EEES4_RKSt5arrayIS2_Lm4EERKNS_6MatrixIdLm3ELm3EEEdRNS9_IdLm10ELm10EEE]+0x1d67): undefined reference to `hyteg::P2Form_epsilon_32::callback'
/usr/bin/ld: ../../src/hyteg/libhyteg.a(P2ElementwiseOperator.cpp.o): in function `hyteg::P2Form_epsilon_33::evalQuadraturePoint3D(hyteg::PointND<double, 3ul> const&, hyteg::PointND<double, 3ul> const&, std::array<hyteg::PointND<double, 3ul>, 4ul> const&, hyteg::Matrix<double, 3ul, 3ul> const&, double, hyteg::Matrix<double, 10ul, 10ul>&) const':
P2ElementwiseOperator.cpp:(.text._ZNK5hyteg17P2Form_epsilon_3321evalQuadraturePoint3DERKNS_7PointNDIdLm3EEES4_RKSt5arrayIS2_Lm4EERKNS_6MatrixIdLm3ELm3EEEdRNS9_IdLm10ELm10EEE[_ZNK5hyteg17P2Form_epsilon_3321evalQuadraturePoint3DERKNS_7PointNDIdLm3EEES4_RKSt5arrayIS2_Lm4EERKNS_6MatrixIdLm3ELm3EEEdRNS9_IdLm10ELm10EEE]+0x20ab): undefined reference to `hyteg::P2Form_epsilon_33::callback'
collect2: error: ld returned 1 exit status
make[2]: *** [apps/2020-moc/CMakeFiles/Benchmark_04_BlendedAdvectionDiffusion.dir/build.make:134: apps/2020-moc/Benchmark_04_BlendedAdvectionDiffusion] Error 1
make[1]: *** [CMakeFiles/Makefile2:16558: apps/2020-moc/CMakeFiles/Benchmark_04_BlendedAdvectionDiffusion.dir/all] Error 2
make: *** [Makefile:141: all] Error 2
ERROR: Job failed: exit code 1
failed
clang_10.0_eigen_petsc Pretest
[ 98%] Linking CXX executable DefectCorrectionStokes
[ 98%] Built target DefectCorrectionStokes
[ 98%] Linking CXX executable StokesSphereTransport
[ 98%] Built target StokesSphereTransport
[ 98%] Linking CXX executable MultigridStudies
[ 98%] Built target MultigridStudies
make: *** [all] Error 2
Makefile:140: recipe for target 'all' failed
ERROR: Job failed: exit code 1