refine timings

23 jobs for koch/gingko-integration in 23 minutes and 37 seconds (queued for 3 seconds)
Name Stage Failure
failed
clang_10.0_mpionly_eigen_petsc_trilinos Pretest
make[1]: *** [apps/2021-tokamak/CMakeFiles/Tokamak.dir/all] Error 2
make[1]: *** Waiting for unfinished jobs....
[100%] Linking CXX executable Scaling_Workshop_02_Spherical_Shell
[100%] Built target Scaling_Workshop_02_Spherical_Shell
[100%] Linking CXX executable Scaling_Workshop_01_Cube
[100%] Built target Scaling_Workshop_01_Cube
make: *** [all] Error 2
Makefile:140: recipe for target 'all' failed
Cleaning up file based variables
ERROR: Job failed: exit code 1
failed
gcc_10_mpionly_dbg_sp Pretest
[ 85%] Built target FunctionIteratorTest
[ 85%] Built target AnnulusMapTest
[ 85%] Built target BlockOperatorBasicTest
[ 85%] Linking CXX executable P2P1StokesElementwiseAnnulusBlendingTest
[ 85%] Linking CXX executable HytegVsFenicsFormTest
[ 85%] Built target HytegVsFenicsFormTest
[ 85%] Built target P2P1StokesElementwiseAnnulusBlendingTest
make: *** [Makefile:141: all] Error 2
Cleaning up file based variables
ERROR: Job failed: exit code 1