added BoundaryOperatorTest, improved RobinLaplaceApp

23 jobs for dechant/generalizedBoundaryConditions in 7 minutes and 23 seconds (queued for 2 seconds)
Status Job ID Name Coverage
  Pretest
failed #691973
docker
clang_10.0_mpionly_eigen_petsc_trilinos

00:07:23

failed #691972
docker
gcc_11_mpionly_dbg_sp

00:05:21

 
  Test
skipped #691991
docker-benchmark
benchmark_ClangBuildAnalyzer
skipped #691990
docker-benchmark
benchmark_build_time
skipped #691983
docker
clang_10.0_mpionly_dbg_eigen_petsc-complex_trilinos
skipped #691984
docker
clang_10.0_mpionly_dbg_sp
skipped #691982
docker
clang_10.0_serial_dbg
skipped #691981
docker
clang_6.0_mpionly_dbg_eigen_petsc-complex_trilinos
skipped #691986
docker
coverage
skipped #691985
docker
docu_build
skipped #691979
docker
gcc_11_mpionly_dbg_eigen_petsc-complex_trilinos
skipped #691980
docker
gcc_11_mpionly_eigen_petsc_trilinos
skipped #691978
docker
gcc_11_serial_dbg
skipped #691975
intel docker
intel_19_mpionly_dbg_eigen_petsc-complex_trilinos
skipped #691976
intel docker
intel_19_mpionly_dbg_sp
skipped #691977
intel docker
intel_19_mpionly_eigen_petsc_trilinos
skipped #691974
intel docker
intel_19_serial_dbg
skipped #691987
win
msvc-14.2_MpiOnly
skipped #691989
win
msvc-14.2_MpiOnly_Dbg
skipped #691988
win
msvc-14.2_Serial_Dbg
 
  Benchmark
manual #691994
docker-benchmark allowed to fail manual
benchmark_clang8
manual #691993
docker-benchmark allowed to fail manual
benchmark_gcc9
manual #691992
docker-benchmark allowed to fail manual
benchmark_intel19
 
Name Stage Failure
failed
clang_10.0_mpionly_eigen_petsc_trilinos Pretest
make[2]: *** Waiting for unfinished jobs....
[ 22%] Linking CXX static library libcore.a
[ 22%] Built target core
make[1]: *** [src/hyteg/CMakeFiles/hyteg.dir/all] Error 2
CMakeFiles/Makefile2:17703: recipe for target 'src/hyteg/CMakeFiles/hyteg.dir/all' failed
make: *** [all] Error 2
Makefile:140: recipe for target 'all' failed
Cleaning up project directory and file based variables
ERROR: Job failed: exit code 1

failed
gcc_11_mpionly_dbg_sp Pretest
make[2]: *** [src/hyteg/CMakeFiles/hyteg.dir/build.make:3066: src/hyteg/CMakeFiles/hyteg.dir/p1functionspace/p1boundary/P1CustomBoundaryOperator.cpp.o] Error 1
make[2]: *** Waiting for unfinished jobs....
make[1]: *** [CMakeFiles/Makefile2:17436: src/hyteg/CMakeFiles/hyteg.dir/all] Error 2
make[1]: *** Waiting for unfinished jobs....
[ 23%] Linking CXX static library libcore.a
[ 23%] Built target core
make: *** [Makefile:141: all] Error 2
Cleaning up project directory and file based variables
ERROR: Job failed: exit code 1