[wip] add ginkgo blocked solver

23 jobs for block-matrices in 10 minutes and 18 seconds (queued for 34 seconds)
Status Job ID Name Coverage
  Pretest
failed #694254
docker
clang_10.0_mpionly_eigen_petsc_trilinos

00:07:16

failed #694253
docker
gcc_10_mpionly_dbg_sp

00:10:18

 
  Test
skipped #694272
docker-benchmark
benchmark_ClangBuildAnalyzer
skipped #694271
docker-benchmark
benchmark_build_time
skipped #694264
docker
clang_10.0_mpionly_dbg_eigen_petsc-complex_trilinos
skipped #694265
docker
clang_10.0_mpionly_dbg_sp
skipped #694263
docker
clang_10.0_serial_dbg
skipped #694262
docker
clang_6.0_mpionly_dbg_eigen_petsc-complex_trilinos
skipped #694267
docker
coverage
skipped #694266
docker
docu_build
skipped #694260
docker
gcc_10_mpionly_dbg_eigen_petsc-complex_trilinos
skipped #694261
docker
gcc_10_mpionly_eigen_petsc_trilinos
skipped #694259
docker
gcc_10_serial_dbg
skipped #694256
intel docker
intel_19_mpionly_dbg_eigen_petsc-complex_trilinos
skipped #694257
intel docker
intel_19_mpionly_dbg_sp
skipped #694258
intel docker
intel_19_mpionly_eigen_petsc_trilinos
skipped #694255
intel docker
intel_19_serial_dbg
skipped #694268
win
msvc-14.2_MpiOnly
skipped #694270
win
msvc-14.2_MpiOnly_Dbg
skipped #694269
win
msvc-14.2_Serial_Dbg
 
  Benchmark
manual #694275
docker-benchmark allowed to fail manual
benchmark_clang8
manual #694274
docker-benchmark allowed to fail manual
benchmark_gcc9
manual #694273
docker-benchmark allowed to fail manual
benchmark_intel19
 
Name Stage Failure
failed
gcc_10_mpionly_dbg_sp Pretest
../../../walberla/src/core/math/DistributedSample.h:38:7: note:   no known conversion for argument 1 from 'MPI_Comm' {aka 'ompi_communicator_t*'} to 'const walberla::math::DistributedSample&'
../../../walberla/src/core/math/DistributedSample.h:38:7: note: candidate: 'walberla::math::DistributedSample::DistributedSample(walberla::math::DistributedSample&&)'
../../../walberla/src/core/math/DistributedSample.h:38:7: note: no known conversion for argument 1 from 'MPI_Comm' {aka 'ompi_communicator_t*'} to 'walberla::math::DistributedSample&&'
make[2]: *** [src/hyteg/CMakeFiles/hyteg.dir/build.make:18978: src/hyteg/CMakeFiles/hyteg.dir/primitivestorage/PrimitiveStorage.cpp.o] Error 1
make[2]: *** Waiting for unfinished jobs....
make[1]: *** [CMakeFiles/Makefile2:17436: src/hyteg/CMakeFiles/hyteg.dir/all] Error 2
make: *** [Makefile:141: all] Error 2
Cleaning up project directory and file based variables
ERROR: Job failed: exit code 1

failed
clang_10.0_mpionly_eigen_petsc_trilinos Pretest
2 errors generated.
make[2]: *** [src/hyteg/CMakeFiles/hyteg.dir/primitivestorage/loadbalancing/DistributedBalancer.cpp.o] Error 1
src/hyteg/CMakeFiles/hyteg.dir/build.make:19003: recipe for target 'src/hyteg/CMakeFiles/hyteg.dir/primitivestorage/loadbalancing/DistributedBalancer.cpp.o' failed
CMakeFiles/Makefile2:17703: recipe for target 'src/hyteg/CMakeFiles/hyteg.dir/all' failed
make[1]: *** [src/hyteg/CMakeFiles/hyteg.dir/all] Error 2
make: *** [all] Error 2
Makefile:140: recipe for target 'all' failed
Cleaning up project directory and file based variables
ERROR: Job failed: exit code 1