double accuracy was missing in cmake call

31 jobs for thoennes/fix-sp-pipeline in 39 minutes and 3 seconds (queued for 15 seconds)
latest
Name Stage Failure
failed
gcc_11_mpionly_dbg_sp Pretest
                 from ../../../src/hyteg/p2functionspace/P2ProjectNormalOperator.cpp:21:
../../../src/hyteg/forms/form_fenics_generated/p2_tet_diffusion.h:6894:33: note: initializing argument 1 of 'virtual void p2_tet_diffusion_cell_integral_0_otherwise::tabulate_tensor(double*, const double* const*, const double*, int) const'
6894 | void tabulate_tensor(double * A,
| ~~~~~~~~~^
make[2]: *** [src/hyteg/CMakeFiles/hyteg.dir/build.make:102: src/hyteg/CMakeFiles/hyteg.dir/p2functionspace/P2ProjectNormalOperator.cpp.o] Error 1
make[1]: *** [CMakeFiles/Makefile2:20851: src/hyteg/CMakeFiles/hyteg.dir/all] Error 2
make: *** [Makefile:141: all] Error 2
Cleaning up project directory and file based variables
ERROR: Job failed: exit code 1