switch to petscScalar in CreateFromLinComb test

36 jobs for boehm/gkb in 126 minutes and 54 seconds (queued for 3 seconds)
Name Stage Failure
failed
clang_6.0_mpionly_dbg_eigen_petsc-complex_trilinos Test
CMakeFiles/Makefile2:27317: recipe for target 'tests/hyteg/CMakeFiles/PetscCreateFromLinCombTest.dir/all' failed
[ 81%] Built target DGPetscApplyTest
[ 81%] Built target DGInterpolateEvaluateTest
[ 81%] Built target DGPoisson3DConvergenceTest
[ 81%] Built target DGPoisson2DConvergenceTest
Makefile:140: recipe for target 'all' failed
make: *** [all] Error 2
Cleaning up project directory and file based variables
ERROR: Job failed: exit code 1

failed
clang_13.0_mpionly_dbg_eigen_petsc-complex_trilinos Test
[ 81%] Built target DGPoisson2DConvergenceTest
[ 81%] Built target PetscTest
[ 81%] Linking CXX executable BlockOperatorBasicTest
[ 81%] Linking CXX executable PetscMatrixAssemblyTest
[ 81%] Built target BlockOperatorBasicTest
[ 81%] Built target PetscMatrixAssemblyTest
make: *** [Makefile:141: all] Error 2
Cleaning up project directory and file based variables
ERROR: Job failed: exit code 1

failed
gcc_11_mpionly_dbg_eigen_petsc-complex_trilinos Test
[ 82%] Built target P1P1StokesUzawaConvergenceTest
[ 82%] Linking CXX executable VectorToVectorOperatorCGTest
[ 82%] Built target SmoothableTest
[ 84%] Linking CXX executable P1P1Stokes3DUzawaConvergenceTest
[ 84%] Built target VectorToVectorOperatorCGTest
[ 84%] Built target P1P1Stokes3DUzawaConvergenceTest
make: *** [Makefile:141: all] Error 2
Cleaning up project directory and file based variables
ERROR: Job failed: exit code 1