vtk output in app

31 jobs for wiedemann/compressibility in 10 minutes and 53 seconds (queued for 2 seconds)
Name Stage Failure
failed
clang_13.0_mpionly_eigen_petsc_trilinos Pretest
make[1]: *** [CMakeFiles/Makefile2:26587: apps/3d_convection/CMakeFiles/3d_convection.dir/all] Error 2
make[1]: *** Waiting for unfinished jobs....
[100%] Linking CXX executable Benchmark_02_SwirlingAdvection
[100%] Built target Benchmark_02_SwirlingAdvection
[100%] Linking CXX executable Benchmark_03_BlendedAdvection
[100%] Built target Benchmark_03_BlendedAdvection
make: *** [Makefile:141: all] Error 2
Cleaning up project directory and file based variables
ERROR: Job failed: exit code 1

failed
gcc_11_mpionly_dbg_sp Pretest
cc1plus: all warnings being treated as errors
make[2]: *** [apps/3d_convection/CMakeFiles/3d_convection.dir/build.make:76: apps/3d_convection/CMakeFiles/3d_convection.dir/ConvectionSimulation.cpp.o] Error 1
make[1]: *** [CMakeFiles/Makefile2:25691: apps/3d_convection/CMakeFiles/3d_convection.dir/all] Error 2
make[1]: *** Waiting for unfinished jobs....
[100%] Linking CXX executable Benchmark_04_BlendedAdvectionDiffusion
[100%] Built target Benchmark_04_BlendedAdvectionDiffusion
make: *** [Makefile:141: all] Error 2
Cleaning up project directory and file based variables
ERROR: Job failed: exit code 1