add timing info

31 jobs for mogli/singularities in 135 minutes and 45 seconds (queued for 2 seconds)
Name Stage Failure
failed
intel_19_mpionly_dbg_eigen_petsc-complex_trilinos Test
[ 92%] Linking CXX executable SingleRowIntegrationTest
[ 92%] Built target AgglomerationSupermanFactorizationTest
[ 92%] Built target SingleRowIntegrationTest
[ 92%] Linking CXX executable P2P1StokesMinResConvergenceTest
[ 92%] Built target P2P1StokesMinResConvergenceTest
Makefile:140: recipe for target 'all' failed
make: *** [all] Error 2
Cleaning up project directory and file based variables
ERROR: Job failed: exit code 1

failed
intel_19_serial_dbg Test
make[2]: *** [src/hyteg/CMakeFiles/hyteg.dir/p2functionspace/generatedKernels/sor_3D_macroface_P2_update_vertexdofs_backwards_impl_102_132.cpp.o] Error 1
src/hyteg/CMakeFiles/hyteg.dir/build.make:12386: recipe for target 'src/hyteg/CMakeFiles/hyteg.dir/p2functionspace/generatedKernels/sor_3D_macroface_P2_update_vertexdofs_backwards_impl_102_132.cpp.o' failed
make[2]: *** Waiting for unfinished jobs....
make[1]: *** [src/hyteg/CMakeFiles/hyteg.dir/all] Error 2
CMakeFiles/Makefile2:20806: recipe for target 'src/hyteg/CMakeFiles/hyteg.dir/all' failed
Makefile:140: recipe for target 'all' failed
make: *** [all] Error 2
Cleaning up project directory and file based variables
ERROR: Job failed: exit code 1