Fixing petsc issues

28 jobs for grid-transfer-operator-refactoring in 71 minutes and 1 second (queued for 34 seconds)
Name Stage Failure
failed
gcc_6_hybrid_dbg_sp Test
	 72 - FunctionMemorySerializationTest2 (Not Run)
73 - FunctionMemorySerializationTest8 (Not Run)
74 - P1StokesBlendingTest1 (Not Run)
75 - P1StokesBlendingTest2 (Not Run)
76 - P1StokesBlendingTest8 (Not Run)
77 - FindMaxMinMagTest1 (Not Run)
78 - FindMaxMinMagTest2 (Not Run)
Errors while running CTest
ERROR: Job failed: exit code 1
failed
gcc_6_mpionly Test
The following tests FAILED:
1 - minres (Not Run)
2 - BlockCG (Not Run)
3 - stokes_stab (Not Run)
4 - fullmg (Not Run)
5 - cg_P1 (Not Run)
6 - cg_P1_varcoeff (Not Run)
Errors while running CTest
ERROR: Job failed: exit code 1
failed
gcc_6_mpionly_dbg Test
	 72 - FunctionMemorySerializationTest2 (Not Run)
73 - FunctionMemorySerializationTest8 (Not Run)
74 - P1StokesBlendingTest1 (Not Run)
75 - P1StokesBlendingTest2 (Not Run)
76 - P1StokesBlendingTest8 (Not Run)
77 - FindMaxMinMagTest1 (Not Run)
78 - FindMaxMinMagTest2 (Not Run)
Errors while running CTest
ERROR: Job failed: exit code 1
failed
gcc_6_eigen Test
The following tests FAILED:
1 - minres (Not Run)
2 - BlockCG (Not Run)
3 - stokes_stab (Not Run)
4 - fullmg (Not Run)
5 - cg_P1 (Not Run)
6 - cg_P1_varcoeff (Not Run)
Errors while running CTest
ERROR: Job failed: exit code 1
failed
gcc_6_petsc Test
The following tests FAILED:
1 - minres (Not Run)
2 - BlockCG (Not Run)
3 - stokes_stab (Not Run)
4 - fullmg (Not Run)
5 - cg_P1 (Not Run)
6 - cg_P1_varcoeff (Not Run)
Errors while running CTest
ERROR: Job failed: exit code 1
failed
intel_17_eigen Test There has been a runner system failure, please try again
Running with gitlab-runner 10.8.0 (079aad9e)
on i10swarm8 6ea5d208
Using Docker executor with image i10git.cs.fau.de:5005/walberla/buildenvs/intel:17 ...
Pulling docker image i10git.cs.fau.de:5005/walberla/buildenvs/intel:17 ...
Using docker image sha256:e91f87701a6e7eb2b17019c151e6f1e533095493f8c347371c12c9045182953b for i10git.cs.fau.de:5005/walberla/buildenvs/intel:17 ...
ERROR: Job failed (system failure): Cannot connect to the Docker daemon at unix:///var/run/docker.sock. Is the docker daemon running?
failed
gcc_7_mpionly Test
The following tests FAILED:
1 - minres (Not Run)
2 - BlockCG (Not Run)
3 - stokes_stab (Not Run)
4 - fullmg (Not Run)
5 - cg_P1 (Not Run)
6 - cg_P1_varcoeff (Not Run)
Errors while running CTest
ERROR: Job failed: exit code 1