Merge branch 'kohl/fixing-nightly' into 'master'

Fixing nightly.

See merge request !523
90 jobs for master in 171 minutes and 26 seconds (queued for 4 seconds)
latest
Name Stage Failure
failed
clang_11.0_mpionly_dbg_eigen_petsc-complex_trilinos Test
hyteg                    = 1840.19 sec*proc (268 tests)

Total Test time (real) = 1688.81 sec

The following tests FAILED:
130 - P2PetscSolveTest3 (Failed)
Errors while running CTest
Cleaning up project directory and file based variables
ERROR: Job failed: exit code 1

failed
gcc_9_mpionly_dbg_eigen_petsc-complex_trilinos Test
[ 84%] Linking CXX executable EdgeDoFToEdgeDoFOperatorTest
[ 84%] Linking CXX executable CircularMapFPETest
[ 84%] Built target CircularMapFPETest
[ 84%] Built target EdgeDoFToEdgeDoFOperatorTest
[ 84%] Linking CXX executable P2UnsteadyDiffusionBlending2DTest
[ 84%] Built target P2UnsteadyDiffusionBlending2DTest
make: *** [Makefile:141: all] Error 2
Cleaning up project directory and file based variables
ERROR: Job failed: exit code 1

failed
gcc_9_serial_dbg Test
[ 92%] Built target P2UnsteadyDiffusionBlending2DTest
[ 92%] Built target OperatorWrapperBasicTest
[ 92%] Linking CXX executable P2LaplaceOperator3DTest
[ 92%] Built target ElementwiseDivKGradCGConvergenceTest
[ 92%] Built target P2GSTest
[ 92%] Built target P2LaplaceOperator3DTest
make: *** [Makefile:141: all] Error 2
Cleaning up project directory and file based variables
ERROR: Job failed: exit code 1