CUDA_ComplexGeometry

- tmpPdf
- numFluidCells
47 jobs for master in 196 minutes and 16 seconds (queued for 5 seconds)
Name Stage Failure
failed
gcc_5_hybrid_dbg Test
[ 95%] Linking CXX executable PoiseuilleChannel
[ 95%] Built target PoiseuilleChannel
[ 95%] Linking CXX executable CouetteFlow
[ 95%] Built target CouetteFlow
[ 95%] Linking CXX executable SchaeferTurek
[ 95%] Built target SchaeferTurek
Makefile:138: recipe for target 'all' failed
make: *** [all] Error 2
ERROR: Job failed: exit code 1
failed
clang_6.0_hybrid_dbg Test
[ 94%] Built target ComplexGeometry
[ 94%] Built target MotionSingleHeavySphere
[ 94%] Linking CXX executable NonUniformGridBenchmark
[ 94%] Built target NonUniformGridBenchmark
[ 94%] Linking CXX executable CouetteFlow
[ 94%] Built target CouetteFlow
Makefile:140: recipe for target 'all' failed
make: *** [all] Error 2
ERROR: Job failed: exit code 1
failed
clang_3.6_mpionly_dbg Test
[100%] Linking CXX executable NonUniformGridBenchmark
[100%] Built target NonUniformGridBenchmark
[100%] Linking CXX executable CouetteFlow
[100%] Built target CouetteFlow
[100%] Linking CXX executable SchaeferTurek
[100%] Built target SchaeferTurek
Makefile:138: recipe for target 'all' failed
make: *** [all] Error 2
ERROR: Job failed: exit code 1
failed
gcc_7_hybrid_dbg Test
make[1]: *** [apps/benchmarks/ComplexGeometryList/CMakeFiles/ComplexGeometryList.dir/all] Error 2
make[1]: *** Waiting for unfinished jobs....
[ 89%] Linking CXX executable MeshDistanceBenchmark
[ 89%] Built target MeshDistanceBenchmark
[ 89%] Linking CXX executable ComplexGeometry
[ 89%] Built target ComplexGeometry
Makefile:140: recipe for target 'all' failed
make: *** [all] Error 2
ERROR: Job failed: exit code 1
failed
gcc_7_hybrid_dbg_sp Test
[ 94%] Linking CXX executable ForcesOnSphereNearPlaneInShearFlow
[ 94%] Built target ForcesOnSphereNearPlaneInShearFlow
[ 94%] Linking CXX executable NonUniformGridBenchmark
[ 94%] Built target NonUniformGridBenchmark
[ 94%] Linking CXX executable CouetteFlow
[ 94%] Built target CouetteFlow
make: *** [all] Error 2
Makefile:140: recipe for target 'all' failed
ERROR: Job failed: exit code 1
failed
gcc_7_mpionly_dbg Test
[ 94%] Linking CXX executable ForcesOnSphereNearPlaneInShearFlow
[ 94%] Built target ForcesOnSphereNearPlaneInShearFlow
[ 94%] Linking CXX executable NonUniformGridBenchmark
[ 94%] Built target NonUniformGridBenchmark
[ 94%] Linking CXX executable CouetteFlow
[ 94%] Built target CouetteFlow
make: *** [all] Error 2
Makefile:140: recipe for target 'all' failed
ERROR: Job failed: exit code 1
failed
gcc_7_hybrid Test
[ 94%] Linking CXX executable FieldExportTest
[ 94%] Built target FieldExportTest
[ 94%] Linking CXX executable ComplexGeometry
[ 94%] Built target ComplexGeometry
[ 94%] Linking CXX executable CouetteFlow
[ 94%] Built target CouetteFlow
Makefile:140: recipe for target 'all' failed
make: *** [all] Error 2
ERROR: Job failed: exit code 1
failed
gcc_5_hybrid Test
[ 96%] Linking CXX executable PoiseuilleChannel
[ 96%] Built target PoiseuilleChannel
[ 96%] Linking CXX executable CouetteFlow
[ 96%] Built target CouetteFlow
[ 96%] Linking CXX executable SchaeferTurek
[ 96%] Built target SchaeferTurek
make: *** [all] Error 2
Makefile:138: recipe for target 'all' failed
ERROR: Job failed: exit code 1
failed
clang_6.0_mpionly_dbg Test
[ 93%] Linking CXX executable CallbackTest
[ 93%] Built target CallbackTest
[ 93%] Linking CXX executable FieldExportTest
[ 93%] Linking CXX executable ComplexGeometry
[ 93%] Built target FieldExportTest
[ 93%] Built target ComplexGeometry
Makefile:140: recipe for target 'all' failed
make: *** [all] Error 2
ERROR: Job failed: exit code 1
failed
clang_6.0_hybrid_dbg_sp Test
make[1]: *** [apps/benchmarks/ComplexGeometryList/CMakeFiles/ComplexGeometryList.dir/all] Error 2
make[1]: *** Waiting for unfinished jobs....
[100%] Linking CXX executable 01_Tutorial_ConfinedGas
[100%] Built target 01_Tutorial_ConfinedGas
[100%] Linking CXX executable 02_Tutorial_ConfinedGasExtended
[100%] Built target 02_Tutorial_ConfinedGasExtended
Makefile:140: recipe for target 'all' failed
make: *** [all] Error 2
ERROR: Job failed: exit code 1
failed
clang_6.0_hybrid Test
make[1]: *** [apps/benchmarks/ComplexGeometryList/CMakeFiles/ComplexGeometryList.dir/all] Error 2
make[1]: *** Waiting for unfinished jobs....
[ 89%] Linking CXX executable FieldExportTest
[ 89%] Built target FieldExportTest
[ 89%] Linking CXX executable ComplexGeometry
[ 89%] Built target ComplexGeometry
Makefile:140: recipe for target 'all' failed
make: *** [all] Error 2
ERROR: Job failed: exit code 1
failed
clang_6.0_serial_dbg Test
make[1]: *** Waiting for unfinished jobs....
CMakeFiles/Makefile2:11050: recipe for target 'apps/benchmarks/ComplexGeometryList/CMakeFiles/ComplexGeometryList.dir/all' failed
[ 91%] Linking CXX executable FieldExportTest
[ 91%] Built target FieldExportTest
[ 91%] Linking CXX executable ComplexGeometry
[ 91%] Built target ComplexGeometry
Makefile:140: recipe for target 'all' failed
make: *** [all] Error 2
ERROR: Job failed: exit code 1
failed
gcc_5_serial_dbg Test
[ 94%] Linking CXX executable PoiseuilleChannel
[ 94%] Built target PoiseuilleChannel
[ 94%] Linking CXX executable CouetteFlow
[ 94%] Built target CouetteFlow
[ 94%] Linking CXX executable SchaeferTurek
[ 94%] Built target SchaeferTurek
Makefile:138: recipe for target 'all' failed
make: *** [all] Error 2
ERROR: Job failed: exit code 1
failed
gcc_7_serial_dbg Test
[ 96%] Linking CXX executable ForcesOnSphereNearPlaneInShearFlow
[ 96%] Built target ForcesOnSphereNearPlaneInShearFlow
[ 96%] Linking CXX executable NonUniformGridBenchmark
[ 96%] Built target NonUniformGridBenchmark
[ 96%] Linking CXX executable CouetteFlow
[ 96%] Built target CouetteFlow
make: *** [all] Error 2
Makefile:140: recipe for target 'all' failed
ERROR: Job failed: exit code 1