Fix use of check_method_equivalence

8 jobs for schiller in 19 minutes and 27 seconds (queued for 8 seconds)
latest
Status Job ID Name Coverage
  Test
passed #573282
cuda11 docker
build-documentation

00:00:47

passed #573281
cuda11 docker
flake8-lint

00:00:06

failed #573276
AVX docker
latest-python

00:09:08

passed #573279
docker
minimal-conda

00:00:52

failed #573277
win
minimal-windows

00:10:03

manual #573280
AVX cuda11 docker allowed to fail manual
pycodegen-integration
failed #573275
AVX cuda11 docker
tests-and-coverage

00:09:24

89.07%
failed #573278
cuda11 docker
ubuntu

00:07:03

 
Name Stage Failure
failed
ubuntu Test

lbmpy_tests/test_poisuille_channel.py:180: AssertionError
============== 16 failed, 419 passed, 4 skipped in 389.46 seconds ==============
Uploading artifacts for failed job
Uploading artifacts...
report.xml: found 1 matching files and directories

Uploading artifacts as "junit" to coordinator... ok
id=573278 responseStatus=201 Created token=FL-kjhBq
Cleaning up file based variables
ERROR: Job failed: exit code 1
failed
latest-python Test
FAILED lbmpy_tests/test_poisuille_channel.py::test_poiseuille_channel[D3Q19-cpu]
FAILED lbmpy_tests/test_poisuille_channel.py::test_poiseuille_channel[D2Q9-cpu]
===== 12 failed, 401 passed, 26 skipped, 31 warnings in 499.84s (0:08:19) ======
Uploading artifacts for failed job
Uploading artifacts...
report.xml: found 1 matching files and directories

Uploading artifacts as "junit" to coordinator... ok
id=573276 responseStatus=201 Created token=YSzrg37p
Cleaning up file based variables
ERROR: Job failed: exit code 1
failed
minimal-windows Test
FAILED lbmpy_tests/test_poisuille_channel.py::test_poiseuille_channel[D2Q9-cpu]
FAILED lbmpy_tests/test_poisuille_channel.py::test_poiseuille_channel[D3Q19-cpu]
FAILED lbmpy_tests/test_force.py::test_total_momentum[0.5-schiller-trt] - ass...
FAILED lbmpy_tests/test_force.py::test_total_momentum[1.5-schiller-trt] - ass...
FAILED lbmpy_tests/test_force.py::test_schiller_vs_guo[D3Q15] - assert F_1*om...
FAILED lbmpy_tests/phasefield/test_phasefield.py::test_neumann_angle - ValueE...
===== 11 failed, 370 passed, 20 skipped, 14 warnings in 474.14s (0:07:54) =====
Cleaning up file based variables
ERROR: Job failed: Process exited with status 1
failed
tests-and-coverage Test
Uploading artifacts as "archive" to coordinator... ok  id=573275 responseStatus=201 Created token=e7e-noJf
Uploading artifacts...
WARNING: coverage.xml: no matching files
ERROR: No files to upload
Uploading artifacts...
report.xml: found 1 matching files and directories

Uploading artifacts as "junit" to coordinator... ok
id=573275 responseStatus=201 Created token=e7e-noJf
Cleaning up file based variables
ERROR: Job failed: exit code 1