Upload New File

34 jobs for master in 25 minutes and 50 seconds (queued for 28 seconds)
Name Stage Failure
failed
gcc_5_serial_dbg Test
[ 40%] Built target DirectionBasedReduceCommTest
[ 40%] Built target GhostLayerCommTest
[ 40%] Built target CellIntervalTest
[ 40%] Built target PropertyTreeTest
[ 40%] Built target MatrixVector2Test
[ 40%] Built target ConfigTest
Makefile:138: recipe for target 'all' failed
make: *** [all] Error 2
ERROR: Job failed: exit code 1
failed
mac_Serial Test
In file included from /Users/testaccounticp/builds/uq60ifih/walberla/src/pe/synchronization/SyncForces.h:36:
/Users/testaccounticp/builds/uq60ifih/walberla/src/pe/communication/ParseMessage.h:39:10: fatal error: 'pe/communication/RigidBodyTemperatureUpdateNotification.h' file not found
#include "pe/communication/RigidBodyTemperatureUpdateNotification.h"
^~~~~~~~~~~~~~~~~~~~~~~~~~~~~~~~~~~~~~~~~~~~~~~~~~~~~~~~~~~
1 error generated.
make[2]: *** [src/pe/CMakeFiles/pe.dir/raytracing/Raytracer.cpp.o] Error 1
make[1]: *** [src/pe/CMakeFiles/pe.dir/all] Error 2
make: *** [all] Error 2
ERROR: Job failed: Process exited with: 1. Reason was: ()
failed
intel_18_mpionly_dbg Test
make[2]: *** [src/pe/CMakeFiles/pe.dir/raytracing/Raytracer.cpp.o] Error 4
make[1]: *** [src/pe/CMakeFiles/pe.dir/all] Error 2
make[1]: *** Waiting for unfinished jobs....
CMakeFiles/Makefile2:1854: recipe for target 'src/pe/CMakeFiles/pe.dir/all' failed
[ 33%] Built target lbm
[ 33%] Built target core
Makefile:140: recipe for target 'all' failed
make: *** [all] Error 2
ERROR: Job failed: exit code 1
failed
gcc_7_hybrid_dbg_sp Test
[ 46%] Built target MPITextFileTest
[ 46%] Built target PropertyTreeTest
[ 46%] Built target UNIQUEID
[ 46%] Built target SweepTimeloopTimerReduction
[ 46%] Built target EquationSolverTest
[ 46%] Built target ParserTest
Makefile:140: recipe for target 'all' failed
make: *** [all] Error 2
ERROR: Job failed: exit code 1
failed
clang_3.6_mpionly_dbg Test
[ 52%] Linking CXX executable SimpleKernelTest
Scanning dependencies of target FieldIndexing3DTest
[ 52%] Building CXX object tests/cuda/CMakeFiles/FieldIndexing3DTest.dir/FieldIndexing3DTest.cpp.o
[ 52%] Linking CXX executable FieldIndexing3DTest
[ 52%] Built target SimpleKernelTest
[ 52%] Built target FieldIndexing3DTest
Makefile:138: recipe for target 'all' failed
make: *** [all] Error 2
ERROR: Job failed: exit code 1
failed
clang-tidy Test
clang-tidy -header-filter=^/builds/uq60ifih/walberla/build/.* -p=/builds/uq60ifih/walberla/build -quiet /builds/uq60ifih/walberla/apps/tutorials/lbm/03_LBLidDrivenCavity.cpp
clang-tidy -header-filter=^/builds/uq60ifih/walberla/build/.* -p=/builds/uq60ifih/walberla/build -quiet /builds/uq60ifih/walberla/apps/tutorials/lbm/01_BasicLBM.cpp
clang-tidy -header-filter=^/builds/uq60ifih/walberla/build/.* -p=/builds/uq60ifih/walberla/build -quiet /builds/uq60ifih/walberla/apps/tutorials/pde/02_HeatEquation.cpp
clang-tidy -header-filter=^/builds/uq60ifih/walberla/build/.* -p=/builds/uq60ifih/walberla/build -quiet /builds/uq60ifih/walberla/apps/tutorials/pde/01_SolvingPDE.cpp
clang-tidy -header-filter=^/builds/uq60ifih/walberla/build/.* -p=/builds/uq60ifih/walberla/build -quiet /builds/uq60ifih/walberla/apps/tutorials/pde/03_HeatEquation_Extensions.cpp
clang-tidy -header-filter=^/builds/uq60ifih/walberla/build/.* -p=/builds/uq60ifih/walberla/build -quiet /builds/uq60ifih/walberla/apps/tutorials/pe/02_ConfinedGasExtended.cpp
clang-tidy -header-filter=^/builds/uq60ifih/walberla/build/.* -p=/builds/uq60ifih/walberla/build -quiet /builds/uq60ifih/walberla/apps/tutorials/pe/01_ConfinedGas.cpp
clang-tidy -header-filter=^/builds/uq60ifih/walberla/build/.* -p=/builds/uq60ifih/walberla/build -quiet /builds/uq60ifih/walberla/apps/showcases/BidisperseFluidizedBed/BidisperseFluidizedBedDPM.cpp
ERROR: Job failed: exit code 1
failed
gcc_5_hybrid_dbg Test
[ 49%] Linking CXX executable SimpleKernelTest
Scanning dependencies of target FieldIndexing3DTest
[ 49%] Building CXX object tests/cuda/CMakeFiles/FieldIndexing3DTest.dir/FieldIndexing3DTest.cpp.o
[ 49%] Linking CXX executable FieldIndexing3DTest
[ 49%] Built target FieldIndexing3DTest
[ 49%] Built target SimpleKernelTest
Makefile:138: recipe for target 'all' failed
make: *** [all] Error 2
ERROR: Job failed: exit code 1
failed
clang_7.0_hybrid_dbg_sp Test
[ 50%] Built target ParserTest
[ 50%] Built target TimerTest
[ 50%] Built target SetReductionTest
[ 50%] Built target SetSelectableObjectTest
[ 50%] Built target TimingPoolTest
[ 50%] Built target PhysicalCheckTest
make: *** [all] Error 2
Makefile:140: recipe for target 'all' failed
ERROR: Job failed: exit code 1
failed
intel_18_hybrid_dbg Test
make[2]: *** [src/pe/CMakeFiles/pe.dir/raytracing/Raytracer.cpp.o] Error 4
CMakeFiles/Makefile2:1854: recipe for target 'src/pe/CMakeFiles/pe.dir/all' failed
make[1]: *** [src/pe/CMakeFiles/pe.dir/all] Error 2
make[1]: *** Waiting for unfinished jobs....
[ 32%] Built target lbm
[ 32%] Built target core
Makefile:140: recipe for target 'all' failed
make: *** [all] Error 2
ERROR: Job failed: exit code 1
failed
gcc_7_hybrid_dbg Test
[ 31%] Built target BlockForestTest
[ 31%] Built target StructuredBlockForestTest
[ 31%] Built target GhostLayerCommTest
[ 31%] Built target DirectionBasedReduceCommTest
[ 31%] Built target MetisTest
[ 31%] Built target ParMetisTest
Makefile:140: recipe for target 'all' failed
make: *** [all] Error 2
ERROR: Job failed: exit code 1
failed
gcc_5_hybrid Test
[ 50%] Built target ParserTest
[ 51%] Linking CXX executable SimpleKernelTest
[ 51%] Built target FieldIndexing3DTest
[ 51%] Built target SimpleKernelTest
[ 51%] Built target CurveGatherTest
[ 51%] Built target AdaptorTest
Makefile:138: recipe for target 'all' failed
make: *** [all] Error 2
ERROR: Job failed: exit code 1
failed
clang_7.0_mpionly_dbg Test
[ 49%] Built target FastInvSqrtTest
[ 49%] Built target TimerTest
[ 49%] Linking CXX executable SetSelectableObjectTest
[ 49%] Built target SetReductionTest
[ 49%] Built target SetSelectableObjectTest
[ 49%] Built target PhysicalCheckTest
Makefile:140: recipe for target 'all' failed
make: *** [all] Error 2
ERROR: Job failed: exit code 1
failed
mac_Serial_Dbg Test
In file included from /Users/testaccounticp/builds/uq60ifih/walberla/src/pe/synchronization/SyncForces.h:36:
/Users/testaccounticp/builds/uq60ifih/walberla/src/pe/communication/ParseMessage.h:39:10: fatal error: 'pe/communication/RigidBodyTemperatureUpdateNotification.h' file not found
#include "pe/communication/RigidBodyTemperatureUpdateNotification.h"
^~~~~~~~~~~~~~~~~~~~~~~~~~~~~~~~~~~~~~~~~~~~~~~~~~~~~~~~~~~
1 error generated.
make[2]: *** [src/pe/CMakeFiles/pe.dir/raytracing/Raytracer.cpp.o] Error 1
make[1]: *** [src/pe/CMakeFiles/pe.dir/all] Error 2
make: *** [all] Error 2
ERROR: Job failed: Process exited with: 1. Reason was: ()
failed
mac_MpiOnly_Dbg Test
In file included from /Users/testaccounticp/builds/uq60ifih/walberla/src/pe/synchronization/SyncForces.h:36:
/Users/testaccounticp/builds/uq60ifih/walberla/src/pe/communication/ParseMessage.h:39:10: fatal error: 'pe/communication/RigidBodyTemperatureUpdateNotification.h' file not found
#include "pe/communication/RigidBodyTemperatureUpdateNotification.h"
^~~~~~~~~~~~~~~~~~~~~~~~~~~~~~~~~~~~~~~~~~~~~~~~~~~~~~~~~~~
1 error generated.
make[2]: *** [src/pe/CMakeFiles/pe.dir/raytracing/Raytracer.cpp.o] Error 1
make[1]: *** [src/pe/CMakeFiles/pe.dir/all] Error 2
make: *** [all] Error 2
ERROR: Job failed: Process exited with: 1. Reason was: ()
failed
mac_MpiOnly Test There has been a runner system failure, please try again
Creating new VM...
WARNING: Failed to create snapshot Base State from base VM macOS
ERROR: Preparation failed: VBoxManageOutput error: VBoxManage: error: Could not find a registered machine named 'macOS'
VBoxManage: error: Details: code VBOX_E_OBJECT_NOT_FOUND (0x80bb0001), component VirtualBoxWrap, interface IVirtualBox, callee nsISupports
VBoxManage: error: Context: "FindMachine(Bstr(pszSrcName).raw(), srcMachine.asOutParam())" at line 433 of file VBoxManageMisc.cpp
Will be retried in 3s ...
ERROR: Job failed (system failure): VBoxManageOutput error: VBoxManage: error: Could not find a registered machine named 'macOS'
VBoxManage: error: Details: code VBOX_E_OBJECT_NOT_FOUND (0x80bb0001), component VirtualBoxWrap, interface IVirtualBox, callee nsISupports
VBoxManage: error: Context: "FindMachine(Bstr(pszSrcName).raw(), srcMachine.asOutParam())" at line 433 of file VBoxManageMisc.cpp
failed
intel_16_hybrid_dbg Test
[ 35%] Built target BlockForestTest
[ 35%] Built target BlockDataIOTest
[ 35%] Built target DeterministicCreation
[ 35%] Built target SaveLoad
[ 35%] Built target DirectionBasedReduceCommTest
[ 35%] Built target GhostLayerCommTest
Makefile:138: recipe for target 'all' failed
make: *** [all] Error 2
ERROR: Job failed: exit code 1
failed
msvc-14.1_MpiOnly_Dbg Test There has been a timeout failure or the job got stuck. Check your timeout limits or try again
No job log
failed
msvc-14.1_Hybrid_SP_Dbg Test There has been a timeout failure or the job got stuck. Check your timeout limits or try again
No job log
failed
clang_7.0_hybrid_dbg Test
make[2]: *** [src/pe/CMakeFiles/pe.dir/raytracing/Raytracer.cpp.o] Error 1
make[1]: *** [src/pe/CMakeFiles/pe.dir/all] Error 2
make[1]: *** Waiting for unfinished jobs....
CMakeFiles/Makefile2:1854: recipe for target 'src/pe/CMakeFiles/pe.dir/all' failed
[ 32%] Built target GenericAABBTest
[ 32%] Built target LoggingTest
Makefile:140: recipe for target 'all' failed
make: *** [all] Error 2
ERROR: Job failed: exit code 1
failed
clang_7.0_serial_dbg Test
CMakeFiles/Makefile2:1854: recipe for target 'src/pe/CMakeFiles/pe.dir/all' failed
Scanning dependencies of target GathervTest
[ 33%] Building CXX object tests/core/CMakeFiles/GathervTest.dir/mpi/GathervTest.cpp.o
[ 33%] Linking CXX executable GathervTest
[ 33%] Built target GathervTest
[ 33%] Built target ParserTest
Makefile:140: recipe for target 'all' failed
make: *** [all] Error 2
ERROR: Job failed: exit code 1
failed
clang_7.0_hybrid Test
CMakeFiles/Makefile2:1854: recipe for target 'src/pe/CMakeFiles/pe.dir/all' failed
make[1]: *** [src/pe/CMakeFiles/pe.dir/all] Error 2
make[1]: *** Waiting for unfinished jobs....
[ 34%] Linking CXX executable SetTest
[ 34%] Built target SweepTimeloopTimerReduction
[ 34%] Built target SetTest
make: *** [all] Error 2
Makefile:140: recipe for target 'all' failed
ERROR: Job failed: exit code 1
failed
gcc_7_mpionly_dbg Test
make[1]: *** [src/pe/CMakeFiles/pe.dir/all] Error 2
make[1]: *** Waiting for unfinished jobs....
[ 29%] Building CXX object tests/blockforest/CMakeFiles/SetupBlockForestTest.dir/SetupBlockForestTest.cpp.o
[ 30%] Linking CXX executable SetupBlockForestTest
[ 30%] Built target vtk
[ 30%] Built target SetupBlockForestTest
make: *** [all] Error 2
Makefile:140: recipe for target 'all' failed
ERROR: Job failed: exit code 1
failed
intel_18_serial_dbg Test
make[2]: *** [src/pe/CMakeFiles/pe.dir/raytracing/Raytracer.cpp.o] Error 4
CMakeFiles/Makefile2:1854: recipe for target 'src/pe/CMakeFiles/pe.dir/all' failed
make[1]: *** [src/pe/CMakeFiles/pe.dir/all] Error 2
make[1]: *** Waiting for unfinished jobs....
[ 23%] Built target lbm
[ 23%] Built target core
make: *** [all] Error 2
Makefile:140: recipe for target 'all' failed
ERROR: Job failed: exit code 1
failed
intel_18_hybrid Test
src/pe/CMakeFiles/pe.dir/build.make:494: recipe for target 'src/pe/CMakeFiles/pe.dir/raytracing/Raytracer.cpp.o' failed
make[1]: *** [src/pe/CMakeFiles/pe.dir/all] Error 2
make[1]: *** Waiting for unfinished jobs....
CMakeFiles/Makefile2:1854: recipe for target 'src/pe/CMakeFiles/pe.dir/all' failed
[ 22%] Built target lbm
[ 22%] Built target core
Makefile:140: recipe for target 'all' failed
make: *** [all] Error 2
ERROR: Job failed: exit code 1
failed
intel_17_serial_dbg Test
[ 27%] Building CXX object src/python_coupling/CMakeFiles/python_coupling.dir/CreateConfig.cpp.o
[ 27%] Building CXX object src/python_coupling/CMakeFiles/python_coupling.dir/Manager.cpp.o
[ 27%] Built target blockforest
[ 27%] Linking CXX static library libpython_coupling.a
xiar: executing 'ar'
[ 27%] Built target python_coupling
Makefile:138: recipe for target 'all' failed
make: *** [all] Error 2
ERROR: Job failed: exit code 1
failed
msvc-14.1_Serial_Dbg Test There has been a timeout failure or the job got stuck. Check your timeout limits or try again
No job log
failed
msvc-14.1_Hybrid Test There has been a timeout failure or the job got stuck. Check your timeout limits or try again
No job log
failed
msvc-14.1_Hybrid_Dbg Test There has been a timeout failure or the job got stuck. Check your timeout limits or try again
No job log
failed
msvc-14_Hybrid_Dbg Test There has been a timeout failure or the job got stuck. Check your timeout limits or try again
No job log
failed
gcc_7_serial_dbg Test
src/pe/CMakeFiles/pe.dir/build.make:494: recipe for target 'src/pe/CMakeFiles/pe.dir/raytracing/Raytracer.cpp.o' failed
CMakeFiles/Makefile2:1854: recipe for target 'src/pe/CMakeFiles/pe.dir/all' failed
make[1]: *** [src/pe/CMakeFiles/pe.dir/all] Error 2
make[1]: *** Waiting for unfinished jobs....
[ 30%] Built target ConcatIterator
[ 30%] Built target MatrixVector2Test
Makefile:140: recipe for target 'all' failed
make: *** [all] Error 2
ERROR: Job failed: exit code 1
failed
intel_18_hybrid_dbg_sp Test
[ 25%] Linking CXX static library libpostprocessing.a
[ 25%] Linking CXX static library libpe_coupling.a
xiar: executing 'ar'
xiar: executing 'ar'
[ 25%] Built target postprocessing
[ 25%] Built target pe_coupling
make: *** [all] Error 2
Makefile:140: recipe for target 'all' failed
ERROR: Job failed: exit code 1
failed
gcc_7_hybrid Test
make[1]: *** Waiting for unfinished jobs....
[ 31%] Built target MetisTest
Scanning dependencies of target DataTypesTest
[ 32%] Building CXX object tests/core/CMakeFiles/DataTypesTest.dir/DataTypesTest.cpp.o
[ 32%] Linking CXX executable DataTypesTest
[ 32%] Built target DataTypesTest
make: *** [all] Error 2
Makefile:140: recipe for target 'all' failed
ERROR: Job failed: exit code 1
failed
intel_17_hybrid Test
[ 28%] Building CXX object src/geometry/CMakeFiles/geometry.dir/structured/RGBAImage.cpp.o
[ 28%] Building CXX object src/geometry/CMakeFiles/geometry.dir/structured/GrayScaleImage.cpp.o
[ 28%] Linking CXX static library libgeometry.a
xiar: executing 'ar'
[ 28%] Built target geometry
[ 28%] Built target core
Makefile:138: recipe for target 'all' failed
make: *** [all] Error 2
ERROR: Job failed: exit code 1