Upload New File

34 jobs for master in 9 minutes and 16 seconds (queued for 41 seconds)
Name Stage Failure
failed
mac_Serial Test There has been a runner system failure, please try again
Creating new VM...
WARNING: Failed to create snapshot Base State from base VM macOS
ERROR: Preparation failed: VBoxManageOutput error: VBoxManage: error: Could not find a registered machine named 'macOS'
VBoxManage: error: Details: code VBOX_E_OBJECT_NOT_FOUND (0x80bb0001), component VirtualBoxWrap, interface IVirtualBox, callee nsISupports
VBoxManage: error: Context: "FindMachine(Bstr(pszSrcName).raw(), srcMachine.asOutParam())" at line 433 of file VBoxManageMisc.cpp
Will be retried in 3s ...
ERROR: Job failed (system failure): VBoxManageOutput error: VBoxManage: error: Could not find a registered machine named 'macOS'
VBoxManage: error: Details: code VBOX_E_OBJECT_NOT_FOUND (0x80bb0001), component VirtualBoxWrap, interface IVirtualBox, callee nsISupports
VBoxManage: error: Context: "FindMachine(Bstr(pszSrcName).raw(), srcMachine.asOutParam())" at line 433 of file VBoxManageMisc.cpp
failed
mac_Serial_Dbg Test There has been a runner system failure, please try again
Creating new VM...
WARNING: Failed to create snapshot Base State from base VM macOS
ERROR: Preparation failed: VBoxManageOutput error: VBoxManage: error: Could not find a registered machine named 'macOS'
VBoxManage: error: Details: code VBOX_E_OBJECT_NOT_FOUND (0x80bb0001), component VirtualBoxWrap, interface IVirtualBox, callee nsISupports
VBoxManage: error: Context: "FindMachine(Bstr(pszSrcName).raw(), srcMachine.asOutParam())" at line 433 of file VBoxManageMisc.cpp
Will be retried in 3s ...
ERROR: Job failed (system failure): VBoxManageOutput error: VBoxManage: error: Could not find a registered machine named 'macOS'
VBoxManage: error: Details: code VBOX_E_OBJECT_NOT_FOUND (0x80bb0001), component VirtualBoxWrap, interface IVirtualBox, callee nsISupports
VBoxManage: error: Context: "FindMachine(Bstr(pszSrcName).raw(), srcMachine.asOutParam())" at line 433 of file VBoxManageMisc.cpp
failed
msvc-14.1_MpiOnly_Dbg Test There has been a timeout failure or the job got stuck. Check your timeout limits or try again
No job log
failed
msvc-14.1_Serial_Dbg Test There has been a timeout failure or the job got stuck. Check your timeout limits or try again
No job log
failed
msvc-14.1_Hybrid Test There has been a timeout failure or the job got stuck. Check your timeout limits or try again
No job log
failed
msvc-14.1_Hybrid_Dbg Test There has been a timeout failure or the job got stuck. Check your timeout limits or try again
No job log
failed
msvc-14_Hybrid_Dbg Test There has been a timeout failure or the job got stuck. Check your timeout limits or try again
No job log
failed
clang_7.0_hybrid_dbg_sp Test
[ 44%] Built target Matrix3Test
[ 44%] Built target EquationSolverTest
[ 44%] Built target FastInvSqrtTest
[ 44%] Built target MultiArrayIOTest
[ 44%] Built target ParserTest
[ 44%] Built target PhysicalCheckTest
Makefile:140: recipe for target 'all' failed
make: *** [all] Error 2
ERROR: Job failed: exit code 1
failed
clang_7.0_hybrid_dbg Test
[ 47%] Built target MapPointToPeriodicDomain
[ 47%] Built target PeriodicIntersectionVolume
[ 47%] Built target PhysicalCheckTest
[ 47%] Built target GreensTest
[ 47%] Built target FftTest
[ 47%] Built target PeriodicIntersect
make: *** [all] Error 2
Makefile:140: recipe for target 'all' failed
ERROR: Job failed: exit code 1
failed
clang_7.0_mpionly_dbg Test
make[1]: *** Waiting for unfinished jobs....
CMakeFiles/Makefile2:1854: recipe for target 'src/pe/CMakeFiles/pe.dir/all' failed
[ 33%] Building CXX object tests/core/CMakeFiles/LoggingTest.dir/logging/LoggingTest.cpp.o
[ 33%] Linking CXX executable LoggingTest
[ 33%] Built target GenericAABBTest
[ 33%] Built target LoggingTest
make: *** [all] Error 2
Makefile:140: recipe for target 'all' failed
ERROR: Job failed: exit code 1
failed
clang_7.0_hybrid Test
make[2]: *** [src/pe/CMakeFiles/pe.dir/raytracing/Raytracer.cpp.o] Error 1
make[1]: *** [src/pe/CMakeFiles/pe.dir/all] Error 2
make[1]: *** Waiting for unfinished jobs....
CMakeFiles/Makefile2:1854: recipe for target 'src/pe/CMakeFiles/pe.dir/all' failed
[ 32%] Built target SetTest
[ 32%] Built target SweepTimeloopTimerReduction
make: *** [all] Error 2
Makefile:140: recipe for target 'all' failed
ERROR: Job failed: exit code 1
failed
gcc_7_hybrid_dbg_sp Test
make[1]: *** [src/pe/CMakeFiles/pe.dir/all] Error 2
make[1]: *** Waiting for unfinished jobs....
[ 29%] Linking CXX executable ConcatIterator
[ 29%] Linking CXX executable MatrixVector2Test
[ 29%] Built target ConcatIterator
[ 29%] Built target MatrixVector2Test
make: *** [all] Error 2
Makefile:140: recipe for target 'all' failed
ERROR: Job failed: exit code 1
failed
gcc_7_serial_dbg Test
[ 38%] Built target BlockDataIOTest
[ 38%] Built target SaveLoad
[ 38%] Built target StructuredBlockForestTest
[ 38%] Built target DeterministicCreation
[ 38%] Built target DirectionBasedReduceCommTest
[ 38%] Built target SweepTimeloopTimerReduction
make: *** [all] Error 2
Makefile:140: recipe for target 'all' failed
ERROR: Job failed: exit code 1
failed
gcc_7_hybrid Test
make[1]: *** [src/pe/CMakeFiles/pe.dir/all] Error 2
make[1]: *** Waiting for unfinished jobs....
[ 31%] Building CXX object tests/core/CMakeFiles/PrintStacktraceTest.dir/debug/PrintStacktraceTest.cpp.o
[ 31%] Linking CXX executable PrintStacktraceTest
[ 31%] Built target ProbeVsExtraMessage
[ 31%] Built target PrintStacktraceTest
make: *** [all] Error 2
Makefile:140: recipe for target 'all' failed
ERROR: Job failed: exit code 1
failed
gcc_5_hybrid Test
[ 46%] Built target BroadcastTest
[ 46%] Built target ReduceTest
[ 46%] Built target MPITextFileTest
[ 46%] Built target SweepTimeloopTimerReduction
[ 46%] Built target SetSelectableObjectTest
[ 46%] Built target PhysicalCheckTest
Makefile:138: recipe for target 'all' failed
make: *** [all] Error 2
ERROR: Job failed: exit code 1
failed
intel_18_hybrid_dbg_sp Test
[ 24%] Building CXX object src/pe_coupling/CMakeFiles/pe_coupling.dir/utility/ForceTorqueOnBodiesScaler.cpp.o
[ 24%] Building CXX object src/pe_coupling/CMakeFiles/pe_coupling.dir/utility/LubricationCorrection.cpp.o
[ 24%] Building CXX object src/pe_coupling/CMakeFiles/pe_coupling.dir/utility/TimeStep.cpp.o
[ 24%] Linking CXX static library libpe_coupling.a
xiar: executing 'ar'
[ 24%] Built target pe_coupling
make: *** [all] Error 2
Makefile:140: recipe for target 'all' failed
ERROR: Job failed: exit code 1
failed
intel_18_hybrid_dbg Test
make[2]: *** [src/pe/CMakeFiles/pe.dir/raytracing/Raytracer.cpp.o] Error 4
make[1]: *** [src/pe/CMakeFiles/pe.dir/all] Error 2
make[1]: *** Waiting for unfinished jobs....
CMakeFiles/Makefile2:1854: recipe for target 'src/pe/CMakeFiles/pe.dir/all' failed
[ 33%] Built target lbm
[ 33%] Built target core
make: *** [all] Error 2
Makefile:140: recipe for target 'all' failed
ERROR: Job failed: exit code 1
failed
intel_18_mpionly_dbg Test
make[2]: *** [src/pe/CMakeFiles/pe.dir/raytracing/Raytracer.cpp.o] Error 4
CMakeFiles/Makefile2:1854: recipe for target 'src/pe/CMakeFiles/pe.dir/all' failed
make[1]: *** [src/pe/CMakeFiles/pe.dir/all] Error 2
make[1]: *** Waiting for unfinished jobs....
[ 23%] Built target lbm
[ 23%] Built target core
Makefile:140: recipe for target 'all' failed
make: *** [all] Error 2
ERROR: Job failed: exit code 1
failed
intel_18_serial_dbg Test
make[1]: *** Waiting for unfinished jobs....
CMakeFiles/Makefile2:1854: recipe for target 'src/pe/CMakeFiles/pe.dir/all' failed
[ 28%] Building CXX object src/vtk/CMakeFiles/vtk.dir/python/Exports.cpp.o
[ 29%] Linking CXX static library libvtk.a
xiar: executing 'ar'
[ 29%] Built target vtk
Makefile:140: recipe for target 'all' failed
make: *** [all] Error 2
ERROR: Job failed: exit code 1
failed
intel_17_serial_dbg Test
[ 23%] Building CXX object src/blockforest/CMakeFiles/blockforest.dir/PhantomBlockForest.cpp.o
[ 25%] Building CXX object src/blockforest/CMakeFiles/blockforest.dir/Initialization.cpp.o
[ 25%] Linking CXX static library libblockforest.a
[ 25%] Built target python_coupling
xiar: executing 'ar'
[ 25%] Built target blockforest
make: *** [all] Error 2
Makefile:138: recipe for target 'all' failed
ERROR: Job failed: exit code 1
failed
intel_17_hybrid Test
src/pe/CMakeFiles/pe.dir/build.make:902: recipe for target 'src/pe/CMakeFiles/pe.dir/raytracing/Raytracer.cpp.o' failed
make[2]: *** [src/pe/CMakeFiles/pe.dir/raytracing/Raytracer.cpp.o] Error 4
CMakeFiles/Makefile2:1291: recipe for target 'src/pe/CMakeFiles/pe.dir/all' failed
make[1]: *** [src/pe/CMakeFiles/pe.dir/all] Error 2
make[1]: *** Waiting for unfinished jobs....
[ 32%] Built target core
make: *** [all] Error 2
Makefile:138: recipe for target 'all' failed
ERROR: Job failed: exit code 1
failed
intel_16_hybrid_dbg Test
[ 38%] Built target BlockForestTest
[ 38%] Built target StructuredBlockForestTest
[ 38%] Built target BlockDataIOTest
[ 38%] Built target GhostLayerCommTest
[ 38%] Built target SaveLoad
[ 38%] Built target DirectionBasedReduceCommTest
make: *** [all] Error 2
Makefile:138: recipe for target 'all' failed
ERROR: Job failed: exit code 1
failed
msvc-14.1_Hybrid_SP_Dbg Test There has been a timeout failure or the job got stuck. Check your timeout limits or try again
No job log
failed
clang-tidy Test
clang-tidy -header-filter=^/builds/uq60ifih/walberla/build/.* -p=/builds/uq60ifih/walberla/build -quiet /builds/uq60ifih/walberla/apps/showcases/PowderBedGenerator/beam/adsorption/ElectronBeamAbsorption.cpp
clang-tidy -header-filter=^/builds/uq60ifih/walberla/build/.* -p=/builds/uq60ifih/walberla/build -quiet /builds/uq60ifih/walberla/apps/showcases/PowderBedGenerator/beam/build/Build.cpp
clang-tidy -header-filter=^/builds/uq60ifih/walberla/build/.* -p=/builds/uq60ifih/walberla/build -quiet /builds/uq60ifih/walberla/apps/showcases/PowderBedGenerator/beam/build/Layer.cpp
clang-tidy -header-filter=^/builds/uq60ifih/walberla/build/.* -p=/builds/uq60ifih/walberla/build -quiet /builds/uq60ifih/walberla/apps/showcases/PowderBedGenerator/beam/build/Movement.cpp
clang-tidy -header-filter=^/builds/uq60ifih/walberla/build/.* -p=/builds/uq60ifih/walberla/build -quiet /builds/uq60ifih/walberla/apps/showcases/PowderBedGenerator/beam/shape/BoxShape.cpp
clang-tidy -header-filter=^/builds/uq60ifih/walberla/build/.* -p=/builds/uq60ifih/walberla/build -quiet /builds/uq60ifih/walberla/apps/showcases/PowderBedGenerator/beam/shape/ShapeFromConfig.cpp
clang-tidy -header-filter=^/builds/uq60ifih/walberla/build/.* -p=/builds/uq60ifih/walberla/build -quiet /builds/uq60ifih/walberla/apps/showcases/PowderBedGenerator/beam/source/BeamFromConfig.cpp
clang-tidy -header-filter=^/builds/uq60ifih/walberla/build/.* -p=/builds/uq60ifih/walberla/build -quiet /builds/uq60ifih/walberla/apps/showcases/PowderBedGenerator/beam/source/ElectronBeam.cpp
ERROR: Job failed: exit code 1
failed
clang_7.0_serial_dbg Test
[ 50%] Built target SetReductionTest
[ 50%] Built target VersionTest
[ 50%] Built target ParserTest
[ 50%] Built target TimingPoolTest
[ 50%] Built target SetSelectableObjectTest
[ 50%] Built target PhysicalCheckTest
Makefile:140: recipe for target 'all' failed
make: *** [all] Error 2
ERROR: Job failed: exit code 1
failed
clang_3.6_mpionly_dbg Test
[ 51%] Building CXX object tests/cuda/CMakeFiles/FieldIndexing3DTest.dir/FieldIndexing3DTest.cpp.o
[ 51%] Building CXX object tests/cuda/CMakeFiles/SimpleKernelTest.dir/SimpleKernelTest.cpp.o
[ 52%] Linking CXX executable FieldIndexing3DTest
[ 53%] Linking CXX executable SimpleKernelTest
[ 53%] Built target FieldIndexing3DTest
[ 53%] Built target SimpleKernelTest
Makefile:138: recipe for target 'all' failed
make: *** [all] Error 2
ERROR: Job failed: exit code 1
failed
gcc_7_hybrid_dbg Test
[ 42%] Built target SweepTimeloopTimerReduction
[ 42%] Built target SampleTest
[ 42%] Built target UNIQUEID
[ 42%] Built target MPITextFileTest
[ 42%] Built target EquationSolverTest
[ 42%] Built target ParserTest
Makefile:140: recipe for target 'all' failed
make: *** [all] Error 2
ERROR: Job failed: exit code 1
failed
gcc_7_mpionly_dbg Test
CMakeFiles/Makefile2:1854: recipe for target 'src/pe/CMakeFiles/pe.dir/all' failed
make[1]: *** [src/pe/CMakeFiles/pe.dir/all] Error 2
make[1]: *** Waiting for unfinished jobs....
[ 29%] Linking CXX executable DeterministicCreation
[ 29%] Built target SetupBlockForestTest
[ 29%] Built target DeterministicCreation
make: *** [all] Error 2
Makefile:140: recipe for target 'all' failed
ERROR: Job failed: exit code 1
failed
gcc_5_hybrid_dbg Test
[ 40%] Built target DeterministicCreation
[ 40%] Built target StructuredBlockForestTest
[ 40%] Built target ProbeVsExtraMessage
[ 40%] Built target DirectionBasedReduceCommTest
[ 40%] Built target SaveLoad
[ 40%] Built target GhostLayerCommTest
Makefile:138: recipe for target 'all' failed
make: *** [all] Error 2
ERROR: Job failed: exit code 1
failed
gcc_5_serial_dbg Test
[ 39%] Built target DebugTest
[ 39%] Built target TimingPoolTest
[ 39%] Built target Matrix3Test
[ 39%] Built target LoggingTest
[ 39%] Built target SweepTimeloopTimerReduction
[ 39%] Built target PhysicalCheckTest
make: *** [all] Error 2
Makefile:138: recipe for target 'all' failed
ERROR: Job failed: exit code 1
failed
intel_18_hybrid Test
src/pe/CMakeFiles/pe.dir/build.make:494: recipe for target 'src/pe/CMakeFiles/pe.dir/raytracing/Raytracer.cpp.o' failed
CMakeFiles/Makefile2:1854: recipe for target 'src/pe/CMakeFiles/pe.dir/all' failed
make[1]: *** [src/pe/CMakeFiles/pe.dir/all] Error 2
make[1]: *** Waiting for unfinished jobs....
[ 33%] Built target lbm
[ 33%] Built target core
Makefile:140: recipe for target 'all' failed
make: *** [all] Error 2
ERROR: Job failed: exit code 1
failed
mac_MpiOnly Test There has been a runner system failure, please try again
Creating new VM...
WARNING: Failed to create snapshot Base State from base VM macOS
ERROR: Preparation failed: VBoxManageOutput error: VBoxManage: error: Could not find a registered machine named 'macOS'
VBoxManage: error: Details: code VBOX_E_OBJECT_NOT_FOUND (0x80bb0001), component VirtualBoxWrap, interface IVirtualBox, callee nsISupports
VBoxManage: error: Context: "FindMachine(Bstr(pszSrcName).raw(), srcMachine.asOutParam())" at line 433 of file VBoxManageMisc.cpp
Will be retried in 3s ...
ERROR: Job failed (system failure): VBoxManageOutput error: VBoxManage: error: Could not find a registered machine named 'macOS'
VBoxManage: error: Details: code VBOX_E_OBJECT_NOT_FOUND (0x80bb0001), component VirtualBoxWrap, interface IVirtualBox, callee nsISupports
VBoxManage: error: Context: "FindMachine(Bstr(pszSrcName).raw(), srcMachine.asOutParam())" at line 433 of file VBoxManageMisc.cpp
failed
mac_MpiOnly_Dbg Test There has been a runner system failure, please try again
Creating new VM...
WARNING: Failed to create snapshot Base State from base VM macOS
ERROR: Preparation failed: VBoxManageOutput error: VBoxManage: error: Could not find a registered machine named 'macOS'
VBoxManage: error: Details: code VBOX_E_OBJECT_NOT_FOUND (0x80bb0001), component VirtualBoxWrap, interface IVirtualBox, callee nsISupports
VBoxManage: error: Context: "FindMachine(Bstr(pszSrcName).raw(), srcMachine.asOutParam())" at line 433 of file VBoxManageMisc.cpp
Will be retried in 3s ...
ERROR: Job failed (system failure): VBoxManageOutput error: VBoxManage: error: Could not find a registered machine named 'macOS'
VBoxManage: error: Details: code VBOX_E_OBJECT_NOT_FOUND (0x80bb0001), component VirtualBoxWrap, interface IVirtualBox, callee nsISupports
VBoxManage: error: Context: "FindMachine(Bstr(pszSrcName).raw(), srcMachine.asOutParam())" at line 433 of file VBoxManageMisc.cpp