Upload New File

34 jobs for master in 21 minutes and 52 seconds (queued for 5 seconds)
latest
Status Job ID Name Coverage
  Test
failed #252622
docker
clang-tidy

00:02:29

failed #252615
docker cuda
clang_3.6_mpionly_dbg

00:00:56

failed #252616
docker
clang_7.0_hybrid

00:00:50

failed #252619
docker
clang_7.0_hybrid_dbg

00:00:57

failed #252620
docker
clang_7.0_hybrid_dbg_sp

00:01:08

failed #252618
docker
clang_7.0_mpionly_dbg

00:02:13

failed #252617
docker
clang_7.0_serial_dbg

00:00:47

passed #252621
docker
doc

00:01:17

failed #252607
docker cuda
gcc_5_hybrid

00:00:41

failed #252609
docker cuda
gcc_5_hybrid_dbg

00:00:43

failed #252608
docker cuda
gcc_5_serial_dbg

00:00:47

failed #252610
docker
gcc_7_hybrid

00:00:45

failed #252613
docker
gcc_7_hybrid_dbg

00:00:49

failed #252614
docker
gcc_7_hybrid_dbg_sp

00:01:14

failed #252612
docker
gcc_7_mpionly_dbg

00:01:09

failed #252611
docker
gcc_7_serial_dbg

00:00:59

failed #252599
intel docker cuda
intel_16_hybrid_dbg

00:01:12

failed #252600
intel docker
intel_17_hybrid

00:00:58

failed #252601
intel docker
intel_17_serial_dbg

00:01:24

failed #252602
intel docker
intel_18_hybrid

00:01:10

failed #252605
intel docker
intel_18_hybrid_dbg

00:01:12

failed #252606
intel docker
intel_18_hybrid_dbg_sp

00:01:21

failed #252604
intel docker
intel_18_mpionly_dbg

00:01:08

failed #252603
intel docker
intel_18_serial_dbg

00:01:09

failed #252632
mac
mac_MpiOnly

00:00:10

failed #252631
mac
mac_MpiOnly_Dbg

00:13:51

failed #252630
mac
mac_Serial

00:00:10

failed #252629
mac
mac_Serial_Dbg

00:00:10

failed #252626
win
msvc-14.1_Hybrid

failed #252624
win
msvc-14.1_Hybrid_Dbg

failed #252625
win
msvc-14.1_Hybrid_SP_Dbg

failed #252628
win
msvc-14.1_MpiOnly_Dbg

failed #252627
win
msvc-14.1_Serial_Dbg

failed #252623
win
msvc-14_Hybrid_Dbg

 
Name Stage Failure
failed
msvc-14.1_MpiOnly_Dbg Test There has been a timeout failure or the job got stuck. Check your timeout limits or try again
No job log
failed
msvc-14.1_Serial_Dbg Test There has been a timeout failure or the job got stuck. Check your timeout limits or try again
No job log
failed
msvc-14.1_Hybrid Test There has been a timeout failure or the job got stuck. Check your timeout limits or try again
No job log
failed
msvc-14.1_Hybrid_SP_Dbg Test There has been a timeout failure or the job got stuck. Check your timeout limits or try again
No job log
failed
msvc-14.1_Hybrid_Dbg Test There has been a timeout failure or the job got stuck. Check your timeout limits or try again
No job log
failed
msvc-14_Hybrid_Dbg Test There has been a timeout failure or the job got stuck. Check your timeout limits or try again
No job log
failed
clang-tidy Test
clang-tidy -header-filter=^/builds/uq60ifih/walberla/build/.* -p=/builds/uq60ifih/walberla/build -quiet /builds/uq60ifih/walberla/apps/showcases/PowderBedGenerator/beam/adsorption/ElectronBeamAbsorption.cpp
clang-tidy -header-filter=^/builds/uq60ifih/walberla/build/.* -p=/builds/uq60ifih/walberla/build -quiet /builds/uq60ifih/walberla/apps/showcases/PowderBedGenerator/beam/build/Build.cpp
clang-tidy -header-filter=^/builds/uq60ifih/walberla/build/.* -p=/builds/uq60ifih/walberla/build -quiet /builds/uq60ifih/walberla/apps/showcases/PowderBedGenerator/beam/build/Layer.cpp
clang-tidy -header-filter=^/builds/uq60ifih/walberla/build/.* -p=/builds/uq60ifih/walberla/build -quiet /builds/uq60ifih/walberla/apps/showcases/PowderBedGenerator/beam/build/Movement.cpp
clang-tidy -header-filter=^/builds/uq60ifih/walberla/build/.* -p=/builds/uq60ifih/walberla/build -quiet /builds/uq60ifih/walberla/apps/showcases/PowderBedGenerator/beam/shape/BoxShape.cpp
clang-tidy -header-filter=^/builds/uq60ifih/walberla/build/.* -p=/builds/uq60ifih/walberla/build -quiet /builds/uq60ifih/walberla/apps/showcases/PowderBedGenerator/beam/shape/ShapeFromConfig.cpp
clang-tidy -header-filter=^/builds/uq60ifih/walberla/build/.* -p=/builds/uq60ifih/walberla/build -quiet /builds/uq60ifih/walberla/apps/showcases/PowderBedGenerator/beam/source/BeamFromConfig.cpp
clang-tidy -header-filter=^/builds/uq60ifih/walberla/build/.* -p=/builds/uq60ifih/walberla/build -quiet /builds/uq60ifih/walberla/apps/showcases/PowderBedGenerator/beam/source/ElectronBeam.cpp
ERROR: Job failed: exit code 1
failed
clang_7.0_mpionly_dbg Test
[ 56%] Built target MGTest
[ 56%] Built target RBGSTest
[ 56%] Built target CGTest
[ 56%] Built target CurveGatherTest
[ 56%] Linking CXX static library liblbm.a
[ 56%] Built target lbm
make: *** [all] Error 2
Makefile:140: recipe for target 'all' failed
ERROR: Job failed: exit code 1
failed
clang_7.0_hybrid_dbg_sp Test
CMakeFiles/Makefile2:1854: recipe for target 'src/pe/CMakeFiles/pe.dir/all' failed
make[1]: *** [src/pe/CMakeFiles/pe.dir/all] Error 2
make[1]: *** Waiting for unfinished jobs....
[ 29%] Linking CXX executable StructuredBlockForestTest
[ 29%] Built target SaveLoad
[ 29%] Built target StructuredBlockForestTest
make: *** [all] Error 2
Makefile:140: recipe for target 'all' failed
ERROR: Job failed: exit code 1
failed
clang_7.0_hybrid_dbg Test
[ 38%] Built target ParMetisTest
[ 38%] Built target LoggingTest
[ 38%] Built target PlaneTest
[ 38%] Built target GenericAABBTest
[ 38%] Built target ProbeVsExtraMessage
[ 38%] Built target SweepTimeloopTimerReduction
make: *** [all] Error 2
Makefile:140: recipe for target 'all' failed
ERROR: Job failed: exit code 1
failed
clang_7.0_serial_dbg Test
[ 48%] Built target MultiArrayIOTest
[ 48%] Built target GridGeneratorTest
[ 48%] Built target BroadcastTest
[ 48%] Built target FastInvSqrtTest
[ 48%] Built target ParserTest
[ 48%] Built target PhysicalCheckTest
Makefile:140: recipe for target 'all' failed
make: *** [all] Error 2
ERROR: Job failed: exit code 1
failed
gcc_7_hybrid_dbg_sp Test
CMakeFiles/Makefile2:1854: recipe for target 'src/pe/CMakeFiles/pe.dir/all' failed
make[1]: *** [src/pe/CMakeFiles/pe.dir/all] Error 2
make[1]: *** Waiting for unfinished jobs....
[ 29%] Built target DeterministicCreation
[ 29%] Linking CXX executable BlockForestTest
[ 29%] Built target BlockForestTest
Makefile:140: recipe for target 'all' failed
make: *** [all] Error 2
ERROR: Job failed: exit code 1
failed
clang_7.0_hybrid Test
CMakeFiles/Makefile2:1854: recipe for target 'src/pe/CMakeFiles/pe.dir/all' failed
Scanning dependencies of target BufferTest
[ 33%] Building CXX object tests/core/CMakeFiles/BufferTest.dir/mpi/BufferTest.cpp.o
[ 33%] Linking CXX executable BufferTest
[ 33%] Built target ParserTest
[ 33%] Built target BufferTest
Makefile:140: recipe for target 'all' failed
make: *** [all] Error 2
ERROR: Job failed: exit code 1
failed
clang_3.6_mpionly_dbg Test
[ 47%] Built target MPITextFileTest
[ 47%] Linking CXX executable TimerTest
[ 47%] Built target TimerTest
[ 47%] Built target TimingTreeTest
[ 47%] Built target PhysicalCheckTest
[ 47%] Built target ParserTest
Makefile:138: recipe for target 'all' failed
make: *** [all] Error 2
ERROR: Job failed: exit code 1
failed
gcc_7_hybrid_dbg Test
[ 43%] Built target ReduceTest
[ 43%] Built target Matrix3Test
[ 43%] Built target MultiArrayIOTest
[ 43%] Built target BufferSystemTest
[ 43%] Built target GridGeneratorTest
[ 43%] Built target ParserTest
make: *** [all] Error 2
Makefile:140: recipe for target 'all' failed
ERROR: Job failed: exit code 1
failed
gcc_7_mpionly_dbg Test
[ 28%] Building CXX object src/timeloop/CMakeFiles/timeloop.dir/Timeloop.cpp.o
[ 28%] Linking CXX static library libpython_coupling.a
[ 29%] Building CXX object src/timeloop/CMakeFiles/timeloop.dir/python/Exports.cpp.o
[ 29%] Linking CXX static library libtimeloop.a
[ 29%] Built target python_coupling
[ 29%] Built target timeloop
make: *** [all] Error 2
Makefile:140: recipe for target 'all' failed
ERROR: Job failed: exit code 1
failed
gcc_5_hybrid_dbg Test
[ 38%] Built target BlockForestTest
[ 38%] Built target SaveLoad
[ 38%] Built target DirectionBasedReduceCommTest
[ 38%] Built target DeterministicCreation
[ 38%] Built target BlockDataIOTest
[ 38%] Built target GhostLayerCommTest
Makefile:138: recipe for target 'all' failed
make: *** [all] Error 2
ERROR: Job failed: exit code 1
failed
gcc_7_serial_dbg Test
make[1]: *** [src/pe/CMakeFiles/pe.dir/all] Error 2
make[1]: *** Waiting for unfinished jobs....
[ 28%] Building CXX object src/vtk/CMakeFiles/vtk.dir/python/Exports.cpp.o
[ 28%] Built target SetupBlockForestTest
[ 29%] Linking CXX static library libvtk.a
[ 29%] Built target vtk
make: *** [all] Error 2
Makefile:140: recipe for target 'all' failed
ERROR: Job failed: exit code 1
failed
gcc_5_serial_dbg Test
[ 41%] Built target GathervTest
[ 41%] Built target PrintStacktraceTest
[ 41%] Built target SampleTest
[ 41%] Built target LoggingTest
[ 41%] Built target SweepTimeloopTimerReduction
[ 41%] Built target PhysicalCheckTest
make: *** [all] Error 2
Makefile:138: recipe for target 'all' failed
ERROR: Job failed: exit code 1
failed
gcc_5_hybrid Test
[ 45%] Built target PrimesTest
[ 45%] Built target BroadcastTest
[ 45%] Built target GatherTest
[ 45%] Built target ReduceTest
[ 45%] Built target SweepTimeloopTimerReduction
[ 45%] Built target PhysicalCheckTest
Makefile:138: recipe for target 'all' failed
make: *** [all] Error 2
ERROR: Job failed: exit code 1
failed
intel_18_hybrid_dbg_sp Test
make[1]: *** [src/pe/CMakeFiles/pe.dir/all] Error 2
make[1]: *** Waiting for unfinished jobs....
[ 25%] Linking CXX static library libpe_coupling.a
xiar: executing 'ar'
[ 25%] Built target postprocessing
[ 25%] Built target pe_coupling
Makefile:140: recipe for target 'all' failed
make: *** [all] Error 2
ERROR: Job failed: exit code 1
failed
gcc_7_hybrid Test
make[1]: *** Waiting for unfinished jobs....
Scanning dependencies of target SetTest
[ 30%] Building CXX object tests/core/CMakeFiles/SetTest.dir/SetTest.cpp.o
[ 30%] Linking CXX executable SetTest
[ 30%] Built target SweepTimeloopTimerReduction
[ 30%] Built target SetTest
make: *** [all] Error 2
Makefile:140: recipe for target 'all' failed
ERROR: Job failed: exit code 1
failed
intel_18_hybrid_dbg Test
src/pe/CMakeFiles/pe.dir/build.make:494: recipe for target 'src/pe/CMakeFiles/pe.dir/raytracing/Raytracer.cpp.o' failed
CMakeFiles/Makefile2:1854: recipe for target 'src/pe/CMakeFiles/pe.dir/all' failed
make[1]: *** [src/pe/CMakeFiles/pe.dir/all] Error 2
make[1]: *** Waiting for unfinished jobs....
[ 33%] Built target lbm
[ 33%] Built target core
Makefile:140: recipe for target 'all' failed
make: *** [all] Error 2
ERROR: Job failed: exit code 1
failed
intel_18_mpionly_dbg Test
src/pe/CMakeFiles/pe.dir/build.make:494: recipe for target 'src/pe/CMakeFiles/pe.dir/raytracing/Raytracer.cpp.o' failed
CMakeFiles/Makefile2:1854: recipe for target 'src/pe/CMakeFiles/pe.dir/all' failed
make[1]: *** [src/pe/CMakeFiles/pe.dir/all] Error 2
make[1]: *** Waiting for unfinished jobs....
[ 33%] Built target lbm
[ 33%] Built target core
Makefile:140: recipe for target 'all' failed
make: *** [all] Error 2
ERROR: Job failed: exit code 1
failed
intel_18_serial_dbg Test
[ 23%] Building CXX object src/pe_coupling/CMakeFiles/pe_coupling.dir/utility/ForceTorqueOnBodiesScaler.cpp.o
[ 23%] Building CXX object src/pe_coupling/CMakeFiles/pe_coupling.dir/utility/LubricationCorrection.cpp.o
[ 23%] Building CXX object src/pe_coupling/CMakeFiles/pe_coupling.dir/utility/TimeStep.cpp.o
[ 23%] Linking CXX static library libpe_coupling.a
xiar: executing 'ar'
[ 23%] Built target pe_coupling
Makefile:140: recipe for target 'all' failed
make: *** [all] Error 2
ERROR: Job failed: exit code 1
failed
intel_17_serial_dbg Test
[ 22%] Building CXX object src/core/CMakeFiles/core.dir/Conversion.cpp.o
[ 23%] Building CXX object src/core/CMakeFiles/core.dir/Environment.cpp.o
[ 23%] Building CXX object src/core/CMakeFiles/core.dir/waLBerlaBuildInfo.cpp.o
[ 23%] Linking CXX static library libcore.a
xiar: executing 'ar'
[ 23%] Built target core
Makefile:138: recipe for target 'all' failed
make: *** [all] Error 2
ERROR: Job failed: exit code 1
failed
intel_18_hybrid Test
src/pe/CMakeFiles/pe.dir/build.make:494: recipe for target 'src/pe/CMakeFiles/pe.dir/raytracing/Raytracer.cpp.o' failed
make[1]: *** [src/pe/CMakeFiles/pe.dir/all] Error 2
make[1]: *** Waiting for unfinished jobs....
CMakeFiles/Makefile2:1854: recipe for target 'src/pe/CMakeFiles/pe.dir/all' failed
[ 33%] Built target lbm
[ 33%] Built target core
Makefile:140: recipe for target 'all' failed
make: *** [all] Error 2
ERROR: Job failed: exit code 1
failed
intel_16_hybrid_dbg Test
[ 38%] Built target BlockForestTest
[ 38%] Built target DeterministicCreation
[ 38%] Built target StructuredBlockForestTest
[ 38%] Built target SaveLoad
[ 38%] Built target DirectionBasedReduceCommTest
[ 38%] Built target GhostLayerCommTest
make: *** [all] Error 2
Makefile:138: recipe for target 'all' failed
ERROR: Job failed: exit code 1
failed
intel_17_hybrid Test
make[2]: *** [src/pe/CMakeFiles/pe.dir/rigidbody/RigidBody.cpp.o] Error 2
CMakeFiles/Makefile2:1789: recipe for target 'src/pe/CMakeFiles/pe.dir/all' failed
make[1]: *** [src/pe/CMakeFiles/pe.dir/all] Error 2
make[1]: *** Waiting for unfinished jobs....
[ 30%] Built target BlockIDTest
[ 30%] Built target SetupBlockForestTest
Makefile:138: recipe for target 'all' failed
make: *** [all] Error 2
ERROR: Job failed: exit code 1
failed
mac_MpiOnly_Dbg Test
In file included from /Users/testaccounticp/builds/uq60ifih/walberla/src/pe/synchronization/SyncForces.h:36:
/Users/testaccounticp/builds/uq60ifih/walberla/src/pe/communication/ParseMessage.h:39:10: fatal error: 'pe/communication/RigidBodyTemperatureUpdateNotification.h' file not found
#include "pe/communication/RigidBodyTemperatureUpdateNotification.h"
^~~~~~~~~~~~~~~~~~~~~~~~~~~~~~~~~~~~~~~~~~~~~~~~~~~~~~~~~~~
1 error generated.
make[2]: *** [src/pe/CMakeFiles/pe.dir/raytracing/Raytracer.cpp.o] Error 1
make[1]: *** [src/pe/CMakeFiles/pe.dir/all] Error 2
make: *** [all] Error 2
ERROR: Job failed: Process exited with: 1. Reason was: ()
failed
mac_MpiOnly Test There has been a runner system failure, please try again
Creating new VM...
WARNING: Failed to create snapshot Base State from base VM macOS
ERROR: Preparation failed: VBoxManageOutput error: VBoxManage: error: Could not find a registered machine named 'macOS'
VBoxManage: error: Details: code VBOX_E_OBJECT_NOT_FOUND (0x80bb0001), component VirtualBoxWrap, interface IVirtualBox, callee nsISupports
VBoxManage: error: Context: "FindMachine(Bstr(pszSrcName).raw(), srcMachine.asOutParam())" at line 433 of file VBoxManageMisc.cpp
Will be retried in 3s ...
ERROR: Job failed (system failure): VBoxManageOutput error: VBoxManage: error: Could not find a registered machine named 'macOS'
VBoxManage: error: Details: code VBOX_E_OBJECT_NOT_FOUND (0x80bb0001), component VirtualBoxWrap, interface IVirtualBox, callee nsISupports
VBoxManage: error: Context: "FindMachine(Bstr(pszSrcName).raw(), srcMachine.asOutParam())" at line 433 of file VBoxManageMisc.cpp
failed
mac_Serial Test There has been a runner system failure, please try again
Creating new VM...
WARNING: Failed to create snapshot Base State from base VM macOS
ERROR: Preparation failed: VBoxManageOutput error: VBoxManage: error: Could not find a registered machine named 'macOS'
VBoxManage: error: Details: code VBOX_E_OBJECT_NOT_FOUND (0x80bb0001), component VirtualBoxWrap, interface IVirtualBox, callee nsISupports
VBoxManage: error: Context: "FindMachine(Bstr(pszSrcName).raw(), srcMachine.asOutParam())" at line 433 of file VBoxManageMisc.cpp
Will be retried in 3s ...
ERROR: Job failed (system failure): VBoxManageOutput error: VBoxManage: error: Could not find a registered machine named 'macOS'
VBoxManage: error: Details: code VBOX_E_OBJECT_NOT_FOUND (0x80bb0001), component VirtualBoxWrap, interface IVirtualBox, callee nsISupports
VBoxManage: error: Context: "FindMachine(Bstr(pszSrcName).raw(), srcMachine.asOutParam())" at line 433 of file VBoxManageMisc.cpp
failed
mac_Serial_Dbg Test There has been a runner system failure, please try again
Creating new VM...
WARNING: Failed to create snapshot Base State from base VM macOS
ERROR: Preparation failed: VBoxManageOutput error: VBoxManage: error: Could not find a registered machine named 'macOS'
VBoxManage: error: Details: code VBOX_E_OBJECT_NOT_FOUND (0x80bb0001), component VirtualBoxWrap, interface IVirtualBox, callee nsISupports
VBoxManage: error: Context: "FindMachine(Bstr(pszSrcName).raw(), srcMachine.asOutParam())" at line 433 of file VBoxManageMisc.cpp
Will be retried in 3s ...
ERROR: Job failed (system failure): VBoxManageOutput error: VBoxManage: error: Could not find a registered machine named 'macOS'
VBoxManage: error: Details: code VBOX_E_OBJECT_NOT_FOUND (0x80bb0001), component VirtualBoxWrap, interface IVirtualBox, callee nsISupports
VBoxManage: error: Context: "FindMachine(Bstr(pszSrcName).raw(), srcMachine.asOutParam())" at line 433 of file VBoxManageMisc.cpp