Merge branch 'fix_stringstream_name_in_macros' into 'master'

Change stringstream name in macros to hopefully avoid name clashes

See merge request !155
135 jobs for master in 523 minutes and 42 seconds (queued for 7 seconds)
Status Job ID Name Coverage
  Pretest
passed #227547
docker
clang_7.0_hybrid_dbg_sp

00:07:40

passed #227546
docker
gcc_8_hybrid

00:41:14

 
  Test
passed #227676
docker-benchmark
benchmark_clang7

00:04:36

passed #227675
docker-benchmark
benchmark_gcc7

00:04:14

passed #227674
docker-benchmark
benchmark_intel19

00:09:32

passed #227653
docker
clang-tidy

00:06:18

passed #227604
docker
clang_3.6_mpionly

00:19:32

passed #227606
docker
clang_3.6_mpionly_dbg

00:14:08

passed #227603
docker
clang_3.6_serial

00:09:12

passed #227605
docker
clang_3.6_serial_dbg

00:27:42

passed #227608
docker
clang_3.7_mpionly

00:18:57

passed #227610
docker
clang_3.7_mpionly_dbg

00:30:03

passed #227607
docker
clang_3.7_serial

00:10:10

passed #227609
docker
clang_3.7_serial_dbg

00:12:36

passed #227613
docker
clang_3.8_hybrid

00:47:20

passed #227616
docker
clang_3.8_hybrid_dbg

00:18:29

passed #227617
docker
clang_3.8_hybrid_dbg_sp

00:16:57

passed #227612
docker
clang_3.8_mpionly

00:21:33

passed #227615
docker
clang_3.8_mpionly_dbg

00:13:21

passed #227611
docker
clang_3.8_serial

00:11:14

passed #227614
docker
clang_3.8_serial_dbg

00:12:49

passed #227620
docker
clang_3.9_hybrid

00:22:41

passed #227623
docker
clang_3.9_hybrid_dbg

00:36:47

passed #227624
docker
clang_3.9_hybrid_dbg_sp

00:16:23

passed #227619
docker
clang_3.9_mpionly

00:21:10

passed #227622
docker
clang_3.9_mpionly_dbg

00:15:19

passed #227618
docker
clang_3.9_serial

00:25:09

passed #227621
docker
clang_3.9_serial_dbg

00:13:39

passed #227627
docker
clang_4.0_hybrid

00:22:17

passed #227630
docker
clang_4.0_hybrid_dbg

00:18:02

passed #227631
docker
clang_4.0_hybrid_dbg_sp

00:16:32

passed #227626
docker
clang_4.0_mpionly

00:36:42

passed #227629
docker
clang_4.0_mpionly_dbg

00:12:47

passed #227625
docker
clang_4.0_serial

00:11:43

passed #227628
docker
clang_4.0_serial_dbg

00:13:26

passed #227634
docker
clang_5.0_hybrid

00:21:14

passed #227637
docker
clang_5.0_hybrid_dbg

00:17:19

passed #227638
docker
clang_5.0_hybrid_dbg_sp

00:33:36

passed #227633
docker
clang_5.0_mpionly

00:20:13

passed #227636
docker
clang_5.0_mpionly_dbg

00:14:23

passed #227632
docker
clang_5.0_serial

00:24:07

passed #227635
docker
clang_5.0_serial_dbg

00:11:31

passed #227641
cuda docker
clang_6.0_hybrid

00:22:53

passed #227644
cuda docker
clang_6.0_hybrid_dbg

00:15:06

passed #227645
cuda docker
clang_6.0_hybrid_dbg_sp

00:15:08

passed #227640
cuda docker
clang_6.0_mpionly

00:20:32

passed #227643
cuda docker
clang_6.0_mpionly_dbg

00:16:10

passed #227639
cuda docker
clang_6.0_serial

00:10:52

passed #227642
cuda docker
clang_6.0_serial_dbg

00:13:19

passed #227648
docker
clang_7.0_hybrid

00:22:41

passed #227651
docker
clang_7.0_hybrid_dbg

00:39:45

passed #227647
docker
clang_7.0_mpionly

00:37:43

passed #227650
docker
clang_7.0_mpionly_dbg

00:05:41

passed #227646
docker
clang_7.0_serial

00:10:25

passed #227649
docker
clang_7.0_serial_dbg

00:31:24

passed #227655
docker
coverage

00:37:54

passed #227654
docker
cppcheck

00:09:16

passed #227652
docker
doc

00:01:12

passed #227578
cuda docker
gcc_5_hybrid

00:25:03

passed #227581
cuda docker
gcc_5_hybrid_dbg

00:20:41

passed #227582
cuda docker
gcc_5_hybrid_dbg_sp

00:23:13

passed #227577
cuda docker
gcc_5_mpionly

00:21:33

passed #227580
cuda docker
gcc_5_mpionly_dbg

00:20:18

passed #227576
cuda docker
gcc_5_serial

00:11:24

passed #227579
cuda docker
gcc_5_serial_dbg

00:17:43

passed #227585
docker
gcc_6_hybrid

00:23:24

passed #227588
docker
gcc_6_hybrid_dbg

00:20:30

passed #227589
docker
gcc_6_hybrid_dbg_sp

00:22:18

passed #227584
docker
gcc_6_mpionly

00:37:12

passed #227587
docker
gcc_6_mpionly_dbg

00:19:02

passed #227583
docker
gcc_6_serial

00:25:28

passed #227586
docker
gcc_6_serial_dbg

00:17:15

passed #227592
cuda docker
gcc_7_hybrid

00:23:44

passed #227595
cuda docker
gcc_7_hybrid_dbg

00:24:30

passed #227596
cuda docker
gcc_7_hybrid_dbg_sp

00:23:24

passed #227591
cuda docker
gcc_7_mpionly

00:22:34

passed #227594
cuda docker
gcc_7_mpionly_dbg

00:22:00

passed #227590
cuda docker
gcc_7_serial

00:12:28

passed #227593
cuda docker
gcc_7_serial_dbg

00:20:16

passed #227601
docker
gcc_8_hybrid_dbg

00:32:22

passed #227602
docker
gcc_8_hybrid_dbg_sp

00:09:10

passed #227598
docker
gcc_8_mpionly

00:38:26

passed #227600
docker
gcc_8_mpionly_dbg

00:03:45

passed #227597
docker
gcc_8_serial

00:27:03

passed #227599
docker
gcc_8_serial_dbg

00:02:12

passed #227550
docker intel
intel_16_hybrid

00:49:18

passed #227553
docker intel
intel_16_hybrid_dbg

01:55:38

passed #227554
docker intel
intel_16_hybrid_dbg_sp

00:58:27

passed #227549
docker intel
intel_16_mpionly

01:05:33

passed #227552
docker intel
intel_16_mpionly_dbg

00:42:02

failed #227548
docker intel
intel_16_serial

00:42:10

failed #227551
docker intel
intel_16_serial_dbg

00:32:53

passed #227557
docker intel
intel_17_hybrid

00:48:17

passed #227560
docker intel
intel_17_hybrid_dbg

00:49:23

passed #227561
docker intel
intel_17_hybrid_dbg_sp

00:49:44

passed #227556
docker intel
intel_17_mpionly

01:02:01

passed #227559
docker intel
intel_17_mpionly_dbg

01:12:55

passed #227555
docker intel
intel_17_serial

00:23:31

passed #227558
docker intel
intel_17_serial_dbg

00:28:11

passed #227564
cuda docker intel
intel_18_hybrid

00:52:33

passed #227567
cuda docker intel
intel_18_hybrid_dbg

00:58:35

passed #227568
cuda docker intel
intel_18_hybrid_dbg_sp

00:52:42

passed #227563
cuda docker intel
intel_18_mpionly

00:34:38

passed #227566
cuda docker intel
intel_18_mpionly_dbg

00:33:03

passed #227562
cuda docker intel
intel_18_serial

00:22:16

passed #227565
cuda docker intel
intel_18_serial_dbg

00:09:13

passed #227571
docker intel
intel_19_hybrid

00:26:46

failed #227574
docker intel
intel_19_hybrid_dbg

02:31:10

passed #227575
docker intel
intel_19_hybrid_dbg_sp

02:32:28

passed #227570
docker intel
intel_19_mpionly

01:16:15

passed #227573
docker intel
intel_19_mpionly_dbg

00:10:54

passed #227569
docker intel
intel_19_serial

01:02:36

passed #227572
docker intel
intel_19_serial_dbg

00:06:52

passed #227673
mac
mac_MpiOnly

01:20:37

failed #227672
mac
mac_MpiOnly_Dbg

02:07:56

passed #227671
mac
mac_Serial

01:21:16

passed #227670
mac
mac_Serial_Dbg

01:31:38

passed #227665
win
msvc-14.1_Hybrid

00:34:56

passed #227663
win
msvc-14.1_Hybrid_Dbg

00:39:57

passed #227664
win
msvc-14.1_Hybrid_SP_Dbg

00:39:32

passed #227669
win
msvc-14.1_MpiOnly

00:33:31

passed #227668
win
msvc-14.1_MpiOnly_Dbg

00:41:35

passed #227667
win
msvc-14.1_Serial

00:23:44

passed #227666
win
msvc-14.1_Serial_Dbg

00:31:44

passed #227658
win
msvc-14_Hybrid

00:48:15

passed #227656
win
msvc-14_Hybrid_Dbg

00:49:28

passed #227657
win
msvc-14_Hybrid_SP_Dbg

00:57:04

passed #227662
win
msvc-14_MpiOnly

00:38:45

passed #227661
win
msvc-14_MpiOnly_Dbg

00:46:28

passed #227660
win
msvc-14_Serial

00:28:01

passed #227659
win
msvc-14_Serial_Dbg

00:36:43

 
  Deploy
skipped #227680
docker allowed to fail manual
conda-py35-linux
skipped #227678
win allowed to fail manual
conda-py35-win
skipped #227679
docker allowed to fail manual
conda-py36-linux
skipped #227677
win allowed to fail manual
conda-py36-win
 
Name Stage Failure
failed
intel_19_hybrid_dbg Test
make[1]: *** [apps/benchmarks/SchaeferTurek/CMakeFiles/SchaeferTurek.dir/all] Error 2
make[1]: *** Waiting for unfinished jobs....
[ 95%] Linking CXX executable PoiseuilleChannel
[ 95%] Built target PoiseuilleChannel
[ 95%] Linking CXX executable CouetteFlow
[ 95%] Built target CouetteFlow
make: *** [all] Error 2
Makefile:140: recipe for target 'all' failed
ERROR: Job failed: exit code 1
failed
intel_16_serial Test
	220 - QPX_Scalar_Equivalence (SEGFAULT)
221 - StencilTest (SEGFAULT)
222 - ComplexGeometry (SEGFAULT)
223 - MeshDistanceBenchmark (SEGFAULT)
224 - CouetteFlowTest0 (SEGFAULT)
225 - PoiseuilleChannelTestParallelPlates0 (SEGFAULT)
226 - PoiseuilleChannelTestPipe0 (SEGFAULT)
Errors while running CTest
ERROR: Job failed: exit code 1
failed
intel_16_serial_dbg Test
	170 - AVX_SSE2_Equivalence (SEGFAULT)
171 - SSE4_SSE2_Equivalence (SEGFAULT)
172 - AVX_Scalar_Equivalence (SEGFAULT)
173 - QPX_Scalar_Equivalence (SEGFAULT)
174 - StencilTest (SEGFAULT)
175 - ComplexGeometry (SEGFAULT)
176 - MeshDistanceBenchmark (SEGFAULT)
Errors while running CTest
ERROR: Job failed: exit code 1
failed
mac_MpiOnly_Dbg Test
simd                     =   3.37 sec*proc (6 tests)
stencil = 0.14 sec*proc (1 test)

Total Test time (real) = 1713.30 sec

The following tests FAILED:
172 - PE_SYNCHRONIZATIONDELETE27_SO (Timeout)
Errors while running CTest
ERROR: Job failed: Process exited with: 1. Reason was: ()