Use _r for all real_t literals

34 jobs for real_t_literal in 302 minutes and 17 seconds (queued for 404 minutes and 33 seconds)
latest
Status Job ID Name Coverage
  Pretest
passed #243843
docker
clang_7.0_hybrid_dbg_sp

00:34:31

passed #243842
docker
gcc_8_hybrid

00:15:42

 
  Test
passed #243865
docker
clang-tidy

00:02:29

passed #243859
docker
clang_4.0_hybrid_dbg

00:37:57

passed #244228
docker
clang_7.0_hybrid

00:15:26

passed #243863
docker
clang_7.0_hybrid_dbg

00:15:14

passed #243862
docker
clang_7.0_mpionly_dbg

00:14:49

passed #243861
docker
clang_7.0_serial_dbg

00:12:41

passed #243864
docker
doc

00:01:23

passed #243852
docker cuda
gcc_5_hybrid_dbg

00:22:02

passed #243853
docker cuda
gcc_7_hybrid

00:16:35

passed #243854
docker cuda
gcc_7_serial_dbg

00:21:11

passed #243857
docker
gcc_8_hybrid_dbg

00:31:24

passed #243858
docker
gcc_8_hybrid_dbg_sp

00:34:29

passed #243856
docker
gcc_8_mpionly_dbg

00:27:35

passed #243855
docker
gcc_8_serial_dbg

00:47:35

failed #243844
intel docker
intel_17_hybrid_dbg

00:05:43

failed #243845
intel docker cuda
intel_18_hybrid

00:06:28

failed #243846
intel docker cuda
intel_18_serial_dbg

00:06:29

failed #243847
intel docker
intel_19_hybrid

00:06:06

failed #243850
intel docker
intel_19_hybrid_dbg

00:17:44

failed #243851
intel docker
intel_19_hybrid_dbg_sp

00:08:22

failed #243849
intel docker
intel_19_mpionly_dbg

00:10:55

failed #243848
intel docker
intel_19_serial_dbg

00:10:45

passed #243874
mac
mac_MpiOnly

01:12:47

passed #243873
mac
mac_MpiOnly_Dbg

01:37:45

passed #243872
mac
mac_Serial

01:09:22

passed #243871
mac
mac_Serial_Dbg

01:34:36

passed #243868
win
msvc-14.1_Hybrid

00:28:11

passed #243866
win
msvc-14.1_Hybrid_Dbg

00:42:51

passed #243867
win
msvc-14.1_Hybrid_SP_Dbg

00:39:31

passed #243870
win
msvc-14.1_MpiOnly_Dbg

00:37:54

passed #243869
win
msvc-14.1_Serial_Dbg

00:34:16

failed #243860
docker
clang_7.0_hybrid

03:00:09

 
Name Stage Failure
failed
intel_19_hybrid_dbg Test
make[1]: *** [tests/core/CMakeFiles/GridGeneratorTest.dir/all] Error 2
make[1]: *** Waiting for unfinished jobs....
[ 46%] Linking CXX executable MultiArrayIOTest
[ 46%] Built target MultiArrayIOTest
[ 46%] Linking CXX executable BufferSystemTest
[ 46%] Built target BufferSystemTest
Makefile:140: recipe for target 'all' failed
make: *** [all] Error 2
ERROR: Job failed: exit code 1
failed
intel_19_hybrid_dbg_sp Test
[ 46%] Linking CXX executable BufferTest
[ 46%] Linking CXX executable GhostLayerCommTest
[ 46%] Built target BufferTest
[ 46%] Built target GhostLayerCommTest
[ 46%] Linking CXX executable BoundaryHandling
[ 46%] Built target BoundaryHandling
make: *** [all] Error 2
Makefile:140: recipe for target 'all' failed
ERROR: Job failed: exit code 1
failed
intel_19_mpionly_dbg Test
[ 45%] Linking CXX executable GhostLayerCommTest
[ 45%] Built target GhostLayerCommTest
[ 45%] Linking CXX executable BoundaryHandling
[ 45%] Built target BoundaryHandling
[ 45%] Linking CXX executable CheckMacroTest
[ 45%] Built target CheckMacroTest
Makefile:140: recipe for target 'all' failed
make: *** [all] Error 2
ERROR: Job failed: exit code 1
failed
intel_19_serial_dbg Test
[ 46%] Linking CXX executable GhostLayerCommTest
[ 46%] Built target GhostLayerCommTest
[ 46%] Linking CXX executable BoundaryHandling
[ 46%] Built target BoundaryHandling
[ 46%] Linking CXX executable CheckMacroTest
[ 46%] Built target CheckMacroTest
make: *** [all] Error 2
Makefile:140: recipe for target 'all' failed
ERROR: Job failed: exit code 1
failed
intel_19_hybrid Test
[ 49%] Built target SetReductionTest
[ 49%] Linking CXX executable BufferSystemTest
[ 49%] Built target BufferSystemTest
[ 49%] Built target PhysicalCheckTest
[ 49%] Linking CXX executable CheckMacroTest
[ 49%] Built target CheckMacroTest
make: *** [all] Error 2
Makefile:140: recipe for target 'all' failed
ERROR: Job failed: exit code 1
failed
intel_18_serial_dbg Test
[ 47%] Linking CXX executable BufferTest
[ 47%] Built target BufferTest
[ 47%] Linking CXX executable GhostLayerCommTest
[ 47%] Linking CXX executable BoundaryHandling
[ 47%] Built target GhostLayerCommTest
[ 47%] Built target BoundaryHandling
make: *** [all] Error 2
Makefile:140: recipe for target 'all' failed
ERROR: Job failed: exit code 1
failed
intel_18_hybrid Test
[ 57%] Linking CXX executable BufferSystemTest
[ 57%] Built target RandomTest
[ 57%] Built target BufferSystemTest
[ 57%] Built target PhysicalCheckTest
[ 57%] Linking CXX executable CheckMacroTest
[ 57%] Built target CheckMacroTest
Makefile:140: recipe for target 'all' failed
make: *** [all] Error 2
ERROR: Job failed: exit code 1
failed
intel_17_hybrid_dbg Test
[ 38%] Linking CXX executable GenericAABBTest
[ 38%] Linking CXX executable GhostLayerCommTest
[ 38%] Built target GenericAABBTest
[ 38%] Built target GhostLayerCommTest
[ 38%] Linking CXX executable BoundaryHandling
[ 38%] Built target BoundaryHandling
make: *** [all] Error 2
Makefile:138: recipe for target 'all' failed
ERROR: Job failed: exit code 1