Bumped version to 3.1

26 jobs for v3.1 in 59 minutes and 9 seconds (queued for 10 seconds)
latest
Status Job ID Name Coverage
  Test
passed #578417
docker
clang-3.4_MpiOnly_Dbg

00:20:26

passed #578418
docker
clang-3.9_Hybrid

00:09:17

passed #578421
docker
clang-3.9_Hybrid_Dbg

00:26:57

failed #578422
docker
clang-3.9_Hybrid_SP_Dbg

00:00:25

passed #578420
docker
clang-3.9_MpiOnly_Dbg

00:11:53

passed #578419
docker
clang-3.9_Serial_Dbg

00:10:27

passed #578423
docker
doc

00:01:19

passed #578411
docker
gcc-4.7_Hybrid_Dbg

00:37:41

passed #578412
docker
gcc-6_Hybrid

00:23:42

passed #578415
docker
gcc-6_Hybrid_Dbg

00:18:28

failed #578416
docker
gcc-6_Hybrid_SP_Dbg

00:03:05

passed #578414
docker
gcc-6_MpiOnly_Dbg

00:13:32

passed #578413
docker
gcc-6_Serial_Dbg

00:16:00

failed #578404
intel docker
intel-15_Hybrid_Dbg

00:06:18

failed #578405
intel docker
intel-16_Hybrid_Dbg

00:06:11

failed #578406
intel docker
intel-17_Hybrid

00:06:22

failed #578409
intel docker
intel-17_Hybrid_Dbg

00:04:13

failed #578410
intel docker
intel-17_Hybrid_SP_Dbg

00:03:37

failed #578408
intel docker
intel-17_MpiOnly_Dbg

00:05:02

failed #578407
intel docker
intel-17_Serial_Dbg

00:05:49

failed #578424
win
msvc-12_Hybrid_Dbg

00:00:33

failed #578427
win
msvc-14_Hybrid

00:00:53

failed #578425
win
msvc-14_Hybrid_Dbg

00:01:48

failed #578426
win
msvc-14_Hybrid_SP_Dbg

00:01:22

failed #578429
win
msvc-14_MpiOnly_Dbg

00:00:54

failed #578428
win
msvc-14_Serial_Dbg

00:01:40

 
Name Stage Failure
failed
clang-3.9_Hybrid_SP_Dbg Test
3 errors generated.
make[2]: *** [src/blockforest/CMakeFiles/blockforest.dir/BlockForest.cpp.o] Error 1
src/blockforest/CMakeFiles/blockforest.dir/build.make:110: recipe for target 'src/blockforest/CMakeFiles/blockforest.dir/BlockForest.cpp.o' failed
CMakeFiles/Makefile2:1088: recipe for target 'src/blockforest/CMakeFiles/blockforest.dir/all' failed
make[1]: *** [src/blockforest/CMakeFiles/blockforest.dir/all] Error 2
make: *** [all] Error 2
Makefile:138: recipe for target 'all' failed
Cleaning up file based variables
ERROR: Job failed: exit code 1
failed
msvc-14_MpiOnly_Dbg Test

// Convert warnings to errors compiler warnings
WARNING_ERROR:BOOL=ON

// Enables pedantic compiler warnings
WARNING_PEDANTIC:BOOL=ON

Cleaning up file based variables
ERROR: Job failed: Process exited with status 1
failed
gcc-6_Hybrid_SP_Dbg Test
[ 10%] Building CXX object src/core/CMakeFiles/core.dir/timing/TimingPool.cpp.o
[ 10%] Building CXX object src/core/CMakeFiles/core.dir/timing/TimingTree.cpp.o
[ 11%] Building CXX object src/core/CMakeFiles/core.dir/waLBerlaBuildInfo.cpp.o
[ 11%] Linking CXX static library libcore.a
[ 11%] Built target core
Makefile:138: recipe for target 'all' failed
make: *** [all] Error 2
Cleaning up file based variables
ERROR: Job failed: exit code 1
failed
intel-17_Hybrid_SP_Dbg Test
**  5.  /opt/intel/licenses/USE_SERVER.lic
** 6. /Users/Shared/Library/Application Support/Intel/Licenses
** 7. /opt/intel/compilers_and_libraries_2017.0.098/linux/bin/intel64/*.lic

Please refer http://software.intel.com/sites/support/ for more information..

icpc: error #10052: could not checkout FLEXlm license
Cleaning up file based variables
ERROR: Job failed: exit code 1
failed
msvc-14_Serial_Dbg Test

// Convert warnings to errors compiler warnings
WARNING_ERROR:BOOL=ON

// Enables pedantic compiler warnings
WARNING_PEDANTIC:BOOL=ON

Cleaning up file based variables
ERROR: Job failed: Process exited with status 1
failed
intel-17_Hybrid_Dbg Test
**  5.  /opt/intel/licenses/USE_SERVER.lic
** 6. /Users/Shared/Library/Application Support/Intel/Licenses
** 7. /opt/intel/compilers_and_libraries_2017.0.098/linux/bin/intel64/*.lic

Please refer http://software.intel.com/sites/support/ for more information..

icpc: error #10052: could not checkout FLEXlm license
Cleaning up file based variables
ERROR: Job failed: exit code 1
failed
intel-17_MpiOnly_Dbg Test
**  5.  /opt/intel/licenses/USE_SERVER.lic
** 6. /Users/Shared/Library/Application Support/Intel/Licenses
** 7. /opt/intel/compilers_and_libraries_2017.0.098/linux/bin/intel64/*.lic

Please refer http://software.intel.com/sites/support/ for more information..

icpc: error #10052: could not checkout FLEXlm license
Cleaning up file based variables
ERROR: Job failed: exit code 1
failed
msvc-14_Hybrid Test

// Convert warnings to errors compiler warnings
WARNING_ERROR:BOOL=ON

// Enables pedantic compiler warnings
WARNING_PEDANTIC:BOOL=ON

Cleaning up file based variables
ERROR: Job failed: Process exited with status 1
failed
intel-17_Hybrid Test
**  5.  /opt/intel/licenses/USE_SERVER.lic
** 6. /Users/Shared/Library/Application Support/Intel/Licenses
** 7. /opt/intel/compilers_and_libraries_2017.0.098/linux/bin/intel64/*.lic

Please refer http://software.intel.com/sites/support/ for more information..

icpc: error #10052: could not checkout FLEXlm license
Cleaning up file based variables
ERROR: Job failed: exit code 1
failed
intel-17_Serial_Dbg Test
**  5.  /opt/intel/licenses/USE_SERVER.lic
** 6. /Users/Shared/Library/Application Support/Intel/Licenses
** 7. /opt/intel/compilers_and_libraries_2017.0.098/linux/bin/intel64/*.lic

Please refer http://software.intel.com/sites/support/ for more information..

icpc: error #10052: could not checkout FLEXlm license
Cleaning up file based variables
ERROR: Job failed: exit code 1
failed
intel-16_Hybrid_Dbg Test
**  5.  /opt/intel/licenses/USE_SERVER.lic
** 6. /Users/Shared/Library/Application Support/Intel/Licenses
** 7. /opt/intel/compilers_and_libraries_2016.2.181/linux/bin/intel64/*.lic

Please refer http://software.intel.com/sites/support/ for more information..

icpc: error #10052: could not checkout FLEXlm license
Cleaning up file based variables
ERROR: Job failed: exit code 1
failed
intel-15_Hybrid_Dbg Test
**  5.  /opt/intel/licenses/USE_SERVER.lic
** 6. /Users/Shared/Library/Application Support/Intel/Licenses
** 7. /opt/intel/composer_xe_2015.3.187/bin/intel64/*.lic

Please visit http://software.intel.com/sites/support/ if you require technical assistance.

icpc: error #10052: could not checkout FLEXlm license
Cleaning up file based variables
ERROR: Job failed: exit code 1
failed
msvc-14_Hybrid_Dbg Test

// Convert warnings to errors compiler warnings
WARNING_ERROR:BOOL=ON

// Enables pedantic compiler warnings
WARNING_PEDANTIC:BOOL=ON

Cleaning up file based variables
ERROR: Job failed: Process exited with status 1
failed
msvc-14_Hybrid_SP_Dbg Test

// Convert warnings to errors compiler warnings
WARNING_ERROR:BOOL=ON

// Enables pedantic compiler warnings
WARNING_PEDANTIC:BOOL=ON

Cleaning up file based variables
ERROR: Job failed: Process exited with status 1
failed
msvc-12_Hybrid_Dbg Test

-- Configuring incomplete, errors occurred!
See also "C:/cygwin64/home/build/builds/yw25ynew/walberla-cx/build/CMakeFiles/CMakeOutput.log".
-- Cache values
// Semicolon separated list of supported configuration types, only supports Debug, Release, MinSizeRel, and RelWithDebInfo, anything else will be ignored.
CMAKE_CONFIGURATION_TYPES:STRING=Debug;Release;MinSizeRel;RelWithDebInfo

Cleaning up file based variables
ERROR: Job failed: Process exited with status 1