Bumped version to 4.0

26 jobs for v4.0dev in 43 minutes and 1 second (queued for 83 minutes and 47 seconds)
latest
Status Job ID Name Coverage
  Test
passed #578530
docker
clang-3.4_MpiOnly_Dbg

00:18:33

passed #578531
docker
clang-3.9_Hybrid

00:21:49

passed #578534
docker
clang-3.9_Hybrid_Dbg

00:11:42

failed #578535
docker
clang-3.9_Hybrid_SP_Dbg

00:02:10

passed #578533
docker
clang-3.9_MpiOnly_Dbg

00:11:02

passed #578532
docker
clang-3.9_Serial_Dbg

00:21:18

passed #578536
docker
doc

00:00:37

passed #578524
docker
gcc-4.7_Hybrid_Dbg

00:08:33

passed #578525
docker
gcc-6_Hybrid

00:10:09

passed #578528
docker
gcc-6_Hybrid_Dbg

00:14:15

failed #578529
docker
gcc-6_Hybrid_SP_Dbg

00:03:00

passed #578527
docker
gcc-6_MpiOnly_Dbg

00:16:39

passed #578526
docker
gcc-6_Serial_Dbg

00:16:15

failed #578517
intel docker
intel-15_Hybrid_Dbg

00:05:26

failed #578518
intel docker
intel-16_Hybrid_Dbg

00:05:59

failed #578519
intel docker
intel-17_Hybrid

00:03:25

failed #578522
intel docker
intel-17_Hybrid_Dbg

00:05:12

failed #578523
intel docker
intel-17_Hybrid_SP_Dbg

00:03:25

failed #578521
intel docker
intel-17_MpiOnly_Dbg

00:03:27

failed #578520
intel docker
intel-17_Serial_Dbg

00:03:28

failed #578537
win
msvc-12_Hybrid_Dbg

00:01:17

failed #578540
win
msvc-14_Hybrid

00:01:39

failed #578538
win
msvc-14_Hybrid_Dbg

00:01:19

failed #578539
win
msvc-14_Hybrid_SP_Dbg

00:00:53

failed #578542
win
msvc-14_MpiOnly_Dbg

00:01:22

failed #578541
win
msvc-14_Serial_Dbg

00:00:52

 
Name Stage Failure
failed
clang-3.9_Hybrid_SP_Dbg Test
[ 15%] Building CXX object src/core/CMakeFiles/core.dir/timing/TimingPool.cpp.o
[ 15%] Building CXX object src/core/CMakeFiles/core.dir/timing/TimingTree.cpp.o
[ 16%] Building CXX object src/core/CMakeFiles/core.dir/waLBerlaBuildInfo.cpp.o
[ 16%] Linking CXX static library libcore.a
[ 16%] Built target core
Makefile:138: recipe for target 'all' failed
make: *** [all] Error 2
Cleaning up file based variables
ERROR: Job failed: exit code 1
failed
gcc-6_Hybrid_SP_Dbg Test
[ 26%] Building CXX object src/core/CMakeFiles/core.dir/waLBerlaBuildInfo.cpp.o
[ 26%] Linking CXX static library liblbm.a
[ 26%] Built target lbm
[ 26%] Linking CXX static library libcore.a
[ 26%] Built target core
Makefile:138: recipe for target 'all' failed
make: *** [all] Error 2
Cleaning up file based variables
ERROR: Job failed: exit code 1
failed
intel-17_Hybrid_Dbg Test
**  5.  /opt/intel/licenses/USE_SERVER.lic
** 6. /Users/Shared/Library/Application Support/Intel/Licenses
** 7. /opt/intel/compilers_and_libraries_2017.0.098/linux/bin/intel64/*.lic

Please refer http://software.intel.com/sites/support/ for more information..

icpc: error #10052: could not checkout FLEXlm license
Cleaning up file based variables
ERROR: Job failed: exit code 1
failed
intel-17_Hybrid_SP_Dbg Test
**  5.  /opt/intel/licenses/USE_SERVER.lic
** 6. /Users/Shared/Library/Application Support/Intel/Licenses
** 7. /opt/intel/compilers_and_libraries_2017.0.098/linux/bin/intel64/*.lic

Please refer http://software.intel.com/sites/support/ for more information..

icpc: error #10052: could not checkout FLEXlm license
Cleaning up file based variables
ERROR: Job failed: exit code 1
failed
intel-17_MpiOnly_Dbg Test
**  5.  /opt/intel/licenses/USE_SERVER.lic
** 6. /Users/Shared/Library/Application Support/Intel/Licenses
** 7. /opt/intel/compilers_and_libraries_2017.0.098/linux/bin/intel64/*.lic

Please refer http://software.intel.com/sites/support/ for more information..

icpc: error #10052: could not checkout FLEXlm license
Cleaning up file based variables
ERROR: Job failed: exit code 1
failed
intel-17_Serial_Dbg Test
**  5.  /opt/intel/licenses/USE_SERVER.lic
** 6. /Users/Shared/Library/Application Support/Intel/Licenses
** 7. /opt/intel/compilers_and_libraries_2017.0.098/linux/bin/intel64/*.lic

Please refer http://software.intel.com/sites/support/ for more information..

icpc: error #10052: could not checkout FLEXlm license
Cleaning up file based variables
ERROR: Job failed: exit code 1
failed
intel-17_Hybrid Test
**  5.  /opt/intel/licenses/USE_SERVER.lic
** 6. /Users/Shared/Library/Application Support/Intel/Licenses
** 7. /opt/intel/compilers_and_libraries_2017.0.098/linux/bin/intel64/*.lic

Please refer http://software.intel.com/sites/support/ for more information..

icpc: error #10052: could not checkout FLEXlm license
Cleaning up file based variables
ERROR: Job failed: exit code 1
failed
intel-16_Hybrid_Dbg Test
**  5.  /opt/intel/licenses/USE_SERVER.lic
** 6. /Users/Shared/Library/Application Support/Intel/Licenses
** 7. /opt/intel/compilers_and_libraries_2016.2.181/linux/bin/intel64/*.lic

Please refer http://software.intel.com/sites/support/ for more information..

icpc: error #10052: could not checkout FLEXlm license
Cleaning up file based variables
ERROR: Job failed: exit code 1
failed
intel-15_Hybrid_Dbg Test
**  5.  /opt/intel/licenses/USE_SERVER.lic
** 6. /Users/Shared/Library/Application Support/Intel/Licenses
** 7. /opt/intel/composer_xe_2015.3.187/bin/intel64/*.lic

Please visit http://software.intel.com/sites/support/ if you require technical assistance.

icpc: error #10052: could not checkout FLEXlm license
Cleaning up file based variables
ERROR: Job failed: exit code 1
failed
msvc-14_MpiOnly_Dbg Test

// Convert warnings to errors compiler warnings
WARNING_ERROR:BOOL=ON

// Enables pedantic compiler warnings
WARNING_PEDANTIC:BOOL=ON

Cleaning up file based variables
ERROR: Job failed: Process exited with status 1
failed
msvc-14_Serial_Dbg Test

// Convert warnings to errors compiler warnings
WARNING_ERROR:BOOL=ON

// Enables pedantic compiler warnings
WARNING_PEDANTIC:BOOL=ON

Cleaning up file based variables
ERROR: Job failed: Process exited with status 1
failed
msvc-14_Hybrid Test
  thread regex) (Required is at least version "1.48")
Call Stack (most recent call first):
C:/Program Files/CMake/share/cmake-3.19/Modules/FindPackageHandleStandardArgs.cmake:582 (_FPHSA_FAILURE_MESSAGE)
C:/Program Files/CMake/share/cmake-3.19/Modules/FindBoost.cmake:2193 (find_package_handle_standard_args)
CMakeLists.txt:681 (find_package)


Cleaning up file based variables
ERROR: Job failed: Process exited with status 1
failed
msvc-14_Hybrid_SP_Dbg Test

// Convert warnings to errors compiler warnings
WARNING_ERROR:BOOL=ON

// Enables pedantic compiler warnings
WARNING_PEDANTIC:BOOL=ON

Cleaning up file based variables
ERROR: Job failed: Process exited with status 1
failed
msvc-14_Hybrid_Dbg Test
  thread regex) (Required is at least version "1.48")
Call Stack (most recent call first):
C:/Program Files/CMake/share/cmake-3.19/Modules/FindPackageHandleStandardArgs.cmake:582 (_FPHSA_FAILURE_MESSAGE)
C:/Program Files/CMake/share/cmake-3.19/Modules/FindBoost.cmake:2193 (find_package_handle_standard_args)
CMakeLists.txt:681 (find_package)


Cleaning up file based variables
ERROR: Job failed: Process exited with status 1
failed
msvc-12_Hybrid_Dbg Test

-- Configuring incomplete, errors occurred!
See also "C:/cygwin64/home/build/builds/yw25ynew/walberla-cx/build/CMakeFiles/CMakeOutput.log".
-- Cache values
// Semicolon separated list of supported configuration types, only supports Debug, Release, MinSizeRel, and RelWithDebInfo, anything else will be ignored.
CMAKE_CONFIGURATION_TYPES:STRING=Debug;Release;MinSizeRel;RelWithDebInfo

Cleaning up file based variables
ERROR: Job failed: Process exited with status 1