Raytracer in confinedgas uses a config object

27 jobs for Version-1 in 71 minutes and 2 seconds (queued for 19 minutes and 14 seconds)
latest
Name Stage Failure
failed
msvc-14.1_Hybrid_SP_Dbg Test
  BoundaryHandling.vcxproj -> C:\cygwin64\home\build\builds\yw25ynew\walberla\build\tests\boundary\DebugOptimized\BoundaryHandling.exe
BoundaryHandling.vcxproj -> C:/cygwin64/home/build/builds/yw25ynew/walberla/build/tests/boundary/DebugOptimized/BoundaryHandling.pdb (Full PDB)
AVX_SSE2_Equivalence.vcxproj -> C:\cygwin64\home\build\builds\yw25ynew\walberla\build\tests\simd\DebugOptimized\AVX_SSE2_Equivalence.exe
AVX_SSE2_Equivalence.vcxproj -> C:/cygwin64/home/build/builds/yw25ynew/walberla/build/tests/simd/DebugOptimized/AVX_SSE2_Equivalence.pdb (Full PDB)
BlockDataIOTest.vcxproj -> C:\cygwin64\home\build\builds\yw25ynew\walberla\build\tests\blockforest\DebugOptimized\BlockDataIOTest.exe
BlockDataIOTest.vcxproj -> C:/cygwin64/home/build/builds/yw25ynew/walberla/build/tests/blockforest/DebugOptimized/BlockDataIOTest.pdb (Full PDB)
SchaeferTurek.vcxproj -> C:\cygwin64\home\build\builds\yw25ynew\walberla\build\apps\benchmarks\SchaeferTurek\DebugOptimized\SchaeferTurek.exe
SchaeferTurek.vcxproj -> C:/cygwin64/home/build/builds/yw25ynew/walberla/build/apps/benchmarks/SchaeferTurek/DebugOptimized/SchaeferTurek.pdb (Full PDB)
ERROR: Job failed: Process exited with: 1. Reason was: ()
failed
gcc_5_hybrid Test
                             ^
cc1plus: all warnings being treated as errors
make[2]: *** [apps/tutorials/pe/CMakeFiles/01_Tutorial_ConfinedGas.dir/01_ConfinedGas.cpp.o] Error 1
apps/tutorials/pe/CMakeFiles/01_Tutorial_ConfinedGas.dir/build.make:62: recipe for target 'apps/tutorials/pe/CMakeFiles/01_Tutorial_ConfinedGas.dir/01_ConfinedGas.cpp.o' failed
CMakeFiles/Makefile2:10872: recipe for target 'apps/tutorials/pe/CMakeFiles/01_Tutorial_ConfinedGas.dir/all' failed
make[1]: *** [apps/tutorials/pe/CMakeFiles/01_Tutorial_ConfinedGas.dir/all] Error 2
Makefile:138: recipe for target 'all' failed
make: *** [all] Error 2
ERROR: Job failed: exit code 1
failed
msvc-14.1_Hybrid_Dbg Test
  AccuracyEvaluationTest.vcxproj -> C:\cygwin64\home\build\builds\yw25ynew\walberla\build\tests\field\DebugOptimized\AccuracyEvaluationTest.exe
AccuracyEvaluationTest.vcxproj -> C:/cygwin64/home/build/builds/yw25ynew/walberla/build/tests/field/DebugOptimized/AccuracyEvaluationTest.pdb (Full PDB)
AVX2_AVX_Equivalence.vcxproj -> C:\cygwin64\home\build\builds\yw25ynew\walberla\build\tests\simd\DebugOptimized\AVX2_AVX_Equivalence.exe
AVX2_AVX_Equivalence.vcxproj -> C:/cygwin64/home/build/builds/yw25ynew/walberla/build/tests/simd/DebugOptimized/AVX2_AVX_Equivalence.pdb (Full PDB)
DiffusionTest.vcxproj -> C:\cygwin64\home\build\builds\yw25ynew\walberla\build\tests\lbm\DebugOptimized\DiffusionTest.exe
DiffusionTest.vcxproj -> C:/cygwin64/home/build/builds/yw25ynew/walberla/build/tests/lbm/DebugOptimized/DiffusionTest.pdb (Full PDB)
CouetteFlow.vcxproj -> C:\cygwin64\home\build\builds\yw25ynew\walberla\build\apps\benchmarks\CouetteFlow\DebugOptimized\CouetteFlow.exe
CouetteFlow.vcxproj -> C:/cygwin64/home/build/builds/yw25ynew/walberla/build/apps/benchmarks/CouetteFlow/DebugOptimized/CouetteFlow.pdb (Full PDB)
ERROR: Job failed: Process exited with: 1. Reason was: ()
failed
gcc_6_hybrid Test
[ 96%] Built target BlockIDTest
[ 96%] Built target BlockForestTest
[ 97%] Linking CXX executable CouetteFlow
[ 97%] Built target CouetteFlow
[ 97%] Linking CXX executable SchaeferTurek
[ 97%] Built target SchaeferTurek
Makefile:140: recipe for target 'all' failed
make: *** [all] Error 2
ERROR: Job failed: exit code 1
failed
intel_17_hybrid_dbg_sp Test
	208 - AVX_SSE2_Equivalence (Failed)
209 - SSE4_SSE2_Equivalence (Failed)
210 - AVX_Scalar_Equivalence (Failed)
211 - QPX_Scalar_Equivalence (Failed)
212 - StencilTest (Failed)
216 - 01_Tutorial_ConfinedGas (Failed)
217 - 02_Tutorial_ConfinedGasExtended (Failed)
Errors while running CTest
ERROR: Job failed: exit code 1
failed
intel_15_hybrid_dbg Test
simd                     =   6.07 sec
stencil = 0.56 sec

Total Test time (real) = 50.61 sec

The following tests FAILED:
213 - 01_Tutorial_ConfinedGas (Failed)
Errors while running CTest
ERROR: Job failed: exit code 1
failed
clang_5.0_mpionly_dbg Test
simd                     =   4.09 sec (6 tests)
stencil = 0.20 sec (1 test)

Total Test time (real) = 32.72 sec

The following tests FAILED:
216 - 01_Tutorial_ConfinedGas (Failed)
Errors while running CTest
ERROR: Job failed: exit code 1
failed
clang_5.0_hybrid_dbg Test
python_coupling          =   5.20 sec (3 tests)
simd = 2.19 sec (6 tests)
stencil = 0.39 sec (1 test)

Total Test time (real) = 77.46 sec

The following tests FAILED:
216 - 01_Tutorial_ConfinedGas (Failed)
ERROR: Job failed: exit code 1
failed
clang_5.0_hybrid Test
simd                     =   9.34 sec (6 tests)
stencil = 1.16 sec (1 test)

Total Test time (real) = 142.00 sec

The following tests FAILED:
287 - 01_Tutorial_ConfinedGas (Failed)
Errors while running CTest
ERROR: Job failed: exit code 1
failed
msvc-14.1_Hybrid Test
  Unknown compiler version - please run the configure tests and report the results
02_Sweeps.cpp
Unknown compiler version - please run the configure tests and report the results
AVX2_AVX_Equivalence.vcxproj -> C:\cygwin64\home\build\builds\yw25ynew\walberla\build\tests\simd\Release\AVX2_AVX_Equivalence.exe
03_Tutorial_GameOfLife.vcxproj -> C:\cygwin64\home\build\builds\yw25ynew\walberla\build\apps\tutorials\basics\Release\03_Tutorial_GameOfLife.exe
02_Tutorial_Sweeps.vcxproj -> C:\cygwin64\home\build\builds\yw25ynew\walberla\build\apps\tutorials\basics\Release\02_Tutorial_Sweeps.exe
03_HeatEquation_Extensions.vcxproj -> C:\cygwin64\home\build\builds\yw25ynew\walberla\build\apps\tutorials\pde\Release\03_HeatEquation_Extensions.exe
SchaeferTurek.vcxproj -> C:\cygwin64\home\build\builds\yw25ynew\walberla\build\apps\benchmarks\SchaeferTurek\Release\SchaeferTurek.exe
ERROR: Job failed: Process exited with: 1. Reason was: ()
failed
intel_17_mpionly_dbg Test
	208 - AVX_SSE2_Equivalence (Failed)
209 - SSE4_SSE2_Equivalence (Failed)
210 - AVX_Scalar_Equivalence (Failed)
211 - QPX_Scalar_Equivalence (Failed)
212 - StencilTest (Failed)
216 - 01_Tutorial_ConfinedGas (Failed)
217 - 02_Tutorial_ConfinedGasExtended (Failed)
Errors while running CTest
ERROR: Job failed: exit code 1
failed
gcc_6_serial_dbg Test
[ 98%] Linking CXX executable PoiseuilleChannel
[ 98%] Built target PoiseuilleChannel
[100%] Linking CXX executable CouetteFlow
[100%] Built target CouetteFlow
[100%] Linking CXX executable SchaeferTurek
[100%] Built target SchaeferTurek
Makefile:140: recipe for target 'all' failed
make: *** [all] Error 2
ERROR: Job failed: exit code 1
failed
gcc_6_mpionly_dbg Test
                                       ^~~~~~~~
cc1plus: all warnings being treated as errors
make[2]: *** [apps/tutorials/pe/CMakeFiles/01_Tutorial_ConfinedGas.dir/01_ConfinedGas.cpp.o] Error 1
apps/tutorials/pe/CMakeFiles/01_Tutorial_ConfinedGas.dir/build.make:62: recipe for target 'apps/tutorials/pe/CMakeFiles/01_Tutorial_ConfinedGas.dir/01_ConfinedGas.cpp.o' failed
CMakeFiles/Makefile2:10561: recipe for target 'apps/tutorials/pe/CMakeFiles/01_Tutorial_ConfinedGas.dir/all' failed
make[1]: *** [apps/tutorials/pe/CMakeFiles/01_Tutorial_ConfinedGas.dir/all] Error 2
Makefile:140: recipe for target 'all' failed
make: *** [all] Error 2
ERROR: Job failed: exit code 1
failed
msvc-14.1_Serial_Dbg Test
  BlockForestTest.vcxproj -> C:\cygwin64\home\build\builds\yw25ynew\walberla\build\tests\blockforest\DebugOptimized\BlockForestTest.exe
BlockForestTest.vcxproj -> C:/cygwin64/home/build/builds/yw25ynew/walberla/build/tests/blockforest/DebugOptimized/BlockForestTest.pdb (Full PDB)
02_Tutorial_Sweeps.vcxproj -> C:\cygwin64\home\build\builds\yw25ynew\walberla\build\apps\tutorials\basics\DebugOptimized\02_Tutorial_Sweeps.exe
02_Tutorial_Sweeps.vcxproj -> C:/cygwin64/home/build/builds/yw25ynew/walberla/build/apps/tutorials/basics/DebugOptimized/02_Tutorial_Sweeps.pdb (Full PDB)
03_HeatEquation_Extensions.vcxproj -> C:\cygwin64\home\build\builds\yw25ynew\walberla\build\apps\tutorials\pde\DebugOptimized\03_HeatEquation_Extensions.exe
03_HeatEquation_Extensions.vcxproj -> C:/cygwin64/home/build/builds/yw25ynew/walberla/build/apps/tutorials/pde/DebugOptimized/03_HeatEquation_Extensions.pdb (Full PDB)
02_HeatEquation.vcxproj -> C:\cygwin64\home\build\builds\yw25ynew\walberla\build\apps\tutorials\pde\DebugOptimized\02_HeatEquation.exe
02_HeatEquation.vcxproj -> C:/cygwin64/home/build/builds/yw25ynew/walberla/build/apps/tutorials/pde/DebugOptimized/02_HeatEquation.pdb (Full PDB)
ERROR: Job failed: Process exited with: 1. Reason was: ()
failed
msvc-12_Hybrid_Dbg Test
  02_Sweeps.cpp
SchaeferTurek.vcxproj -> C:\cygwin64\home\build\builds\yw25ynew\walberla\build\apps\benchmarks\SchaeferTurek\DebugOptimized\SchaeferTurek.exe
CGTest.vcxproj -> C:\cygwin64\home\build\builds\yw25ynew\walberla\build\tests\pde\DebugOptimized\CGTest.exe
AVX2_AVX_Equivalence.vcxproj -> C:\cygwin64\home\build\builds\yw25ynew\walberla\build\tests\simd\DebugOptimized\AVX2_AVX_Equivalence.exe
03_HeatEquation_Extensions.vcxproj -> C:\cygwin64\home\build\builds\yw25ynew\walberla\build\apps\tutorials\pde\DebugOptimized\03_HeatEquation_Extensions.exe
03_Tutorial_GameOfLife.vcxproj -> C:\cygwin64\home\build\builds\yw25ynew\walberla\build\apps\tutorials\basics\DebugOptimized\03_Tutorial_GameOfLife.exe
02_Tutorial_Sweeps.vcxproj -> C:\cygwin64\home\build\builds\yw25ynew\walberla\build\apps\tutorials\basics\DebugOptimized\02_Tutorial_Sweeps.exe
02_HeatEquation.vcxproj -> C:\cygwin64\home\build\builds\yw25ynew\walberla\build\apps\tutorials\pde\DebugOptimized\02_HeatEquation.exe
ERROR: Job failed: Process exited with: 1. Reason was: ()
failed
clang_5.0_hybrid_dbg_sp Test
                      ~ ~~~~~~~~~~~~~~~~~~~~~~~~~~~~~~~~~~~~~~~~~~~~~~~~~~~~^~~
1 error generated.
src/pe/CMakeFiles/pe.dir/build.make:854: recipe for target 'src/pe/CMakeFiles/pe.dir/raytracing/Raytracer.cpp.o' failed
make[2]: *** [src/pe/CMakeFiles/pe.dir/raytracing/Raytracer.cpp.o] Error 1
CMakeFiles/Makefile2:2171: recipe for target 'src/pe/CMakeFiles/pe.dir/all' failed
make[1]: *** [src/pe/CMakeFiles/pe.dir/all] Error 2
Makefile:138: recipe for target 'all' failed
make: *** [all] Error 2
ERROR: Job failed: exit code 1
failed
msvc-14.1_MpiOnly_Dbg Test
  03_HeatEquation_Extensions.vcxproj -> C:\cygwin64\home\build\builds\yw25ynew\walberla\build\apps\tutorials\pde\DebugOptimized\03_HeatEquation_Extensions.exe
03_HeatEquation_Extensions.vcxproj -> C:/cygwin64/home/build/builds/yw25ynew/walberla/build/apps/tutorials/pde/DebugOptimized/03_HeatEquation_Extensions.pdb (Full PDB)
03_LBLidDrivenCavity.vcxproj -> C:\cygwin64\home\build\builds\yw25ynew\walberla\build\apps\tutorials\lbm\DebugOptimized\03_LBLidDrivenCavity.exe
03_LBLidDrivenCavity.vcxproj -> C:/cygwin64/home/build/builds/yw25ynew/walberla/build/apps/tutorials/lbm/DebugOptimized/03_LBLidDrivenCavity.pdb (Full PDB)
02_HeatEquation.vcxproj -> C:\cygwin64\home\build\builds\yw25ynew\walberla\build\apps\tutorials\pde\DebugOptimized\02_HeatEquation.exe
02_HeatEquation.vcxproj -> C:/cygwin64/home/build/builds/yw25ynew/walberla/build/apps/tutorials/pde/DebugOptimized/02_HeatEquation.pdb (Full PDB)
SchaeferTurek.vcxproj -> C:\cygwin64\home\build\builds\yw25ynew\walberla\build\apps\benchmarks\SchaeferTurek\DebugOptimized\SchaeferTurek.exe
SchaeferTurek.vcxproj -> C:/cygwin64/home/build/builds/yw25ynew/walberla/build/apps/benchmarks/SchaeferTurek/DebugOptimized/SchaeferTurek.pdb (Full PDB)
ERROR: Job failed: Process exited with: 1. Reason was: ()
failed
gcc_6_hybrid_dbg Test
[ 96%] Linking CXX executable BlockForestTest
[ 96%] Built target BlockForestTest
[ 97%] Linking CXX executable CouetteFlow
[ 97%] Built target CouetteFlow
[ 97%] Linking CXX executable SchaeferTurek
[ 97%] Built target SchaeferTurek
make: *** [all] Error 2
Makefile:140: recipe for target 'all' failed
ERROR: Job failed: exit code 1
failed
gcc_6_hybrid_dbg_sp Test
[ 98%] Built target NonUniformGridBenchmark
[ 98%] Built target PoiseuilleChannel
[100%] Linking CXX executable CouetteFlow
[100%] Linking CXX executable SchaeferTurek
[100%] Built target CouetteFlow
[100%] Built target SchaeferTurek
make: *** [all] Error 2
Makefile:140: recipe for target 'all' failed
ERROR: Job failed: exit code 1
failed
gcc_4.7_hybrid_dbg Test
Linking CXX executable PoiseuilleChannel
[100%] Built target PoiseuilleChannel
Linking CXX executable CouetteFlow
[100%] Built target CouetteFlow
Linking CXX executable SchaeferTurek
[100%] Built target SchaeferTurek
make: *** [all] Error 2
make: INTERNAL: Exiting with 16 jobserver tokens available; should be 15!
ERROR: Job failed: exit code 1
failed
intel_17_hybrid_dbg Test
	208 - AVX_SSE2_Equivalence (Failed)
209 - SSE4_SSE2_Equivalence (Failed)
210 - AVX_Scalar_Equivalence (Failed)
211 - QPX_Scalar_Equivalence (Failed)
212 - StencilTest (Failed)
216 - 01_Tutorial_ConfinedGas (Failed)
217 - 02_Tutorial_ConfinedGasExtended (Failed)
Errors while running CTest
ERROR: Job failed: exit code 1
failed
clang_3.4_mpionly_dbg Test
simd                     =   2.63 sec
stencil = 0.45 sec

Total Test time (real) = 180.27 sec

The following tests FAILED:
213 - 01_Tutorial_ConfinedGas (Failed)
Errors while running CTest
ERROR: Job failed: exit code 1
failed
gcc_5_serial_dbg Test
                                       ^
cc1plus: all warnings being treated as errors
apps/tutorials/pe/CMakeFiles/01_Tutorial_ConfinedGas.dir/build.make:62: recipe for target 'apps/tutorials/pe/CMakeFiles/01_Tutorial_ConfinedGas.dir/01_ConfinedGas.cpp.o' failed
make[2]: *** [apps/tutorials/pe/CMakeFiles/01_Tutorial_ConfinedGas.dir/01_ConfinedGas.cpp.o] Error 1
CMakeFiles/Makefile2:10828: recipe for target 'apps/tutorials/pe/CMakeFiles/01_Tutorial_ConfinedGas.dir/all' failed
make[1]: *** [apps/tutorials/pe/CMakeFiles/01_Tutorial_ConfinedGas.dir/all] Error 2
Makefile:138: recipe for target 'all' failed
make: *** [all] Error 2
ERROR: Job failed: exit code 1
failed
intel_17_hybrid Test
	276 - StencilTest (Failed)
277 - CouetteFlowTestNoCheckRelease (Failed)
280 - PoiseuilleChannelTestParallelPlatesNoCheckRelease (Failed)
281 - PoiseuilleChannelTestPipeNoCheckRelease (Failed)
286 - SchaeferTurekTest (Failed)
287 - 01_Tutorial_ConfinedGas (Failed)
288 - 02_Tutorial_ConfinedGasExtended (Failed)
Errors while running CTest
ERROR: Job failed: exit code 1