Gather intersections only on root

27 jobs for Version-2 in 79 minutes and 2 seconds (queued for 3 seconds)
latest
Name Stage Failure
failed
msvc-14.1_MpiOnly_Dbg Test

Total Test time (real) = 336.45 sec

The following tests FAILED:
156 - PE_RAYTRACING (Failed)
209 - 01_Tutorial_ConfinedGas (Failed)
210 - 02_Tutorial_ConfinedGasExtended (Failed)
Errors while running CTest
ERROR: Job failed: Process exited with: 1. Reason was: ()
failed
msvc-14.1_Hybrid_SP_Dbg Test
  03_HeatEquation_Extensions.vcxproj -> C:\cygwin64\home\build\builds\yw25ynew\walberla\build\apps\tutorials\pde\DebugOptimized\03_HeatEquation_Extensions.exe
03_HeatEquation_Extensions.vcxproj -> C:/cygwin64/home/build/builds/yw25ynew/walberla/build/apps/tutorials/pde/DebugOptimized/03_HeatEquation_Extensions.pdb (Full PDB)
Poiseuille.vcxproj -> C:\cygwin64\home\build\builds\yw25ynew\walberla\build\tests\lbm\DebugOptimized\Poiseuille.exe
Poiseuille.vcxproj -> C:/cygwin64/home/build/builds/yw25ynew/walberla/build/tests/lbm/DebugOptimized/Poiseuille.pdb (Full PDB)
SchaeferTurek.vcxproj -> C:\cygwin64\home\build\builds\yw25ynew\walberla\build\apps\benchmarks\SchaeferTurek\DebugOptimized\SchaeferTurek.exe
SchaeferTurek.vcxproj -> C:/cygwin64/home/build/builds/yw25ynew/walberla/build/apps/benchmarks/SchaeferTurek/DebugOptimized/SchaeferTurek.pdb (Full PDB)
CouetteFlow.vcxproj -> C:\cygwin64\home\build\builds\yw25ynew\walberla\build\apps\benchmarks\CouetteFlow\DebugOptimized\CouetteFlow.exe
CouetteFlow.vcxproj -> C:/cygwin64/home/build/builds/yw25ynew/walberla/build/apps/benchmarks/CouetteFlow/DebugOptimized/CouetteFlow.pdb (Full PDB)
ERROR: Job failed: Process exited with: 1. Reason was: ()
failed
msvc-14.1_Hybrid_Dbg Test

Total Test time (real) = 354.05 sec

The following tests FAILED:
156 - PE_RAYTRACING (Failed)
209 - 01_Tutorial_ConfinedGas (Failed)
210 - 02_Tutorial_ConfinedGasExtended (Failed)
Errors while running CTest
ERROR: Job failed: Process exited with: 1. Reason was: ()
failed
msvc-12_Hybrid_Dbg Test
  02_Sweeps.cpp
03_GameOfLife.cpp
BlockDataIOTest.vcxproj -> C:\cygwin64\home\build\builds\yw25ynew\walberla\build\tests\blockforest\DebugOptimized\BlockDataIOTest.exe
AccuracyEvaluationTest.vcxproj -> C:\cygwin64\home\build\builds\yw25ynew\walberla\build\tests\field\DebugOptimized\AccuracyEvaluationTest.exe
02_Tutorial_Sweeps.vcxproj -> C:\cygwin64\home\build\builds\yw25ynew\walberla\build\apps\tutorials\basics\DebugOptimized\02_Tutorial_Sweeps.exe
03_Tutorial_GameOfLife.vcxproj -> C:\cygwin64\home\build\builds\yw25ynew\walberla\build\apps\tutorials\basics\DebugOptimized\03_Tutorial_GameOfLife.exe
03_HeatEquation_Extensions.vcxproj -> C:\cygwin64\home\build\builds\yw25ynew\walberla\build\apps\tutorials\pde\DebugOptimized\03_HeatEquation_Extensions.exe
SchaeferTurek.vcxproj -> C:\cygwin64\home\build\builds\yw25ynew\walberla\build\apps\benchmarks\SchaeferTurek\DebugOptimized\SchaeferTurek.exe
ERROR: Job failed: Process exited with: 1. Reason was: ()
failed
clang_5.0_hybrid_dbg_sp Test
[ 41%] Built target SaveLoad
[ 41%] Built target BlockForestTest
[ 41%] Built target StructuredBlockForestTest
[ 41%] Built target BlockDataIOTest
[ 41%] Built target DirectionBasedReduceCommTest
[ 41%] Built target GhostLayerCommTest
Makefile:138: recipe for target 'all' failed
make: *** [all] Error 2
ERROR: Job failed: exit code 1
failed
clang_5.0_hybrid_dbg Test

Total Test time (real) = 67.96 sec

The following tests FAILED:
160 - PE_RAYTRACING (Failed)
216 - 01_Tutorial_ConfinedGas (Failed)
217 - 02_Tutorial_ConfinedGasExtended (Failed)
Errors while running CTest
ERROR: Job failed: exit code 1
failed
clang_5.0_serial_dbg Test
simd                     =   1.55 sec (6 tests)
stencil = 0.30 sec (1 test)

Total Test time (real) = 13.76 sec

The following tests FAILED:
97 - PE_RAYTRACING (Failed)
Errors while running CTest
ERROR: Job failed: exit code 1
failed
gcc_6_hybrid_dbg Test
[ 83%] Built target PE_SYNCHRONIZATIONDELETE
[ 83%] Built target PE_UNION
[ 83%] Linking CXX executable PE_SYNCEQUIVALENCE
[ 83%] Built target PE_SYNCEQUIVALENCE
[ 84%] Linking CXX executable SweepEquivalenceTest
[ 84%] Built target SweepEquivalenceTest
Makefile:140: recipe for target 'all' failed
make: *** [all] Error 2
ERROR: Job failed: exit code 1
failed
gcc_6_mpionly_dbg Test
make[1]: *** [tests/pe/CMakeFiles/PE_RAYTRACING.dir/all] Error 2
make[1]: *** Waiting for unfinished jobs....
[ 80%] Linking CXX executable PE_SIMPLECCD
[ 80%] Built target PE_SIMPLECCD
[ 80%] Linking CXX executable PE_SHADOWCOPY
[ 80%] Built target PE_SHADOWCOPY
Makefile:140: recipe for target 'all' failed
make: *** [all] Error 2
ERROR: Job failed: exit code 1
failed
gcc_6_hybrid Test
[ 84%] Built target PE_FORCESYNC
[ 84%] Built target SweepEquivalenceTest
[ 84%] Linking CXX executable PE_UNION
[ 84%] Built target PE_UNION
[ 84%] Linking CXX executable PE_SYNCEQUIVALENCE
[ 84%] Built target PE_SYNCEQUIVALENCE
Makefile:140: recipe for target 'all' failed
make: *** [all] Error 2
ERROR: Job failed: exit code 1
failed
gcc_5_serial_dbg Test
[ 77%] Linking CXX executable PE_SYNCEQUIVALENCE
[ 77%] Linking CXX executable PE_DELETEBODY
[ 77%] Built target PE_DELETEBODY
[ 77%] Built target PE_SYNCEQUIVALENCE
[ 78%] Linking CXX executable SweepEquivalenceTest
[ 78%] Built target SweepEquivalenceTest
Makefile:138: recipe for target 'all' failed
make: *** [all] Error 2
ERROR: Job failed: exit code 1
failed
gcc_4.7_hybrid_dbg Test
[ 89%] Built target PE_RIGIDBODY
Linking CXX executable PE_PARALLELEQUIVALENCE
[ 89%] Built target PE_PARALLELEQUIVALENCE
Linking CXX executable PE_REFINEMENT
Linking CXX executable PE_SERIALIZEDESERIALIZE
[ 89%] Built target PE_REFINEMENT
[ 89%] Built target PE_SERIALIZEDESERIALIZE
make: *** [all] Error 2
ERROR: Job failed: exit code 1
failed
intel_17_hybrid_dbg_sp Test
	207 - AVX_SSE4_Equivalence (Failed)
208 - AVX_SSE2_Equivalence (Failed)
209 - SSE4_SSE2_Equivalence (Failed)
210 - AVX_Scalar_Equivalence (Failed)
211 - QPX_Scalar_Equivalence (Failed)
212 - StencilTest (Failed)
216 - 01_Tutorial_ConfinedGas (Failed)
217 - 02_Tutorial_ConfinedGasExtended (Failed)
ERROR: Job failed: exit code 1
failed
intel_17_hybrid_dbg Test
	208 - AVX_SSE2_Equivalence (Failed)
209 - SSE4_SSE2_Equivalence (Failed)
210 - AVX_Scalar_Equivalence (Failed)
211 - QPX_Scalar_Equivalence (Failed)
212 - StencilTest (Failed)
216 - 01_Tutorial_ConfinedGas (Failed)
217 - 02_Tutorial_ConfinedGasExtended (Failed)
Errors while running CTest
ERROR: Job failed: exit code 1
failed
intel_17_hybrid Test
	276 - StencilTest (Failed)
277 - CouetteFlowTestNoCheckRelease (Failed)
280 - PoiseuilleChannelTestParallelPlatesNoCheckRelease (Failed)
281 - PoiseuilleChannelTestPipeNoCheckRelease (Failed)
286 - SchaeferTurekTest (Failed)
287 - 01_Tutorial_ConfinedGas (Failed)
288 - 02_Tutorial_ConfinedGasExtended (Failed)
Errors while running CTest
ERROR: Job failed: exit code 1
failed
intel_15_hybrid_dbg Test

Total Test time (real) = 74.92 sec

The following tests FAILED:
160 - PE_RAYTRACING (Failed)
213 - 01_Tutorial_ConfinedGas (Failed)
214 - 02_Tutorial_ConfinedGasExtended (Failed)
Errors while running CTest
ERROR: Job failed: exit code 1
failed
msvc-14.1_Serial_Dbg Test
simd                     =   1.25 sec (6 tests)
stencil = 0.14 sec (1 test)

Total Test time (real) = 185.73 sec

The following tests FAILED:
95 - PE_RAYTRACING (Failed)
Errors while running CTest
ERROR: Job failed: Process exited with: 1. Reason was: ()
failed
clang_5.0_mpionly_dbg Test

Total Test time (real) = 100.63 sec

The following tests FAILED:
160 - PE_RAYTRACING (Failed)
216 - 01_Tutorial_ConfinedGas (Failed)
217 - 02_Tutorial_ConfinedGasExtended (Failed)
Errors while running CTest
ERROR: Job failed: exit code 1
failed
intel_17_mpionly_dbg Test
	208 - AVX_SSE2_Equivalence (Failed)
209 - SSE4_SSE2_Equivalence (Failed)
210 - AVX_Scalar_Equivalence (Failed)
211 - QPX_Scalar_Equivalence (Failed)
212 - StencilTest (Failed)
216 - 01_Tutorial_ConfinedGas (Failed)
217 - 02_Tutorial_ConfinedGasExtended (Failed)
Errors while running CTest
ERROR: Job failed: exit code 1
failed
clang_3.4_mpionly_dbg Test

Total Test time (real) = 50.11 sec

The following tests FAILED:
160 - PE_RAYTRACING (Failed)
213 - 01_Tutorial_ConfinedGas (Failed)
214 - 02_Tutorial_ConfinedGasExtended (Failed)
Errors while running CTest
ERROR: Job failed: exit code 1
failed
clang_5.0_hybrid Test

Total Test time (real) = 326.41 sec

The following tests FAILED:
174 - PE_RAYTRACING (Failed)
287 - 01_Tutorial_ConfinedGas (Failed)
288 - 02_Tutorial_ConfinedGasExtended (Failed)
Errors while running CTest
ERROR: Job failed: exit code 1
failed
msvc-14.1_Hybrid Test

Total Test time (real) = 433.08 sec

The following tests FAILED:
170 - PE_RAYTRACING (Failed)
280 - 01_Tutorial_ConfinedGas (Failed)
281 - 02_Tutorial_ConfinedGasExtended (Failed)
Errors while running CTest
ERROR: Job failed: Process exited with: 1. Reason was: ()
failed
gcc_5_hybrid Test
make[1]: *** [tests/pe/CMakeFiles/PE_RAYTRACING.dir/all] Error 2
make[1]: *** Waiting for unfinished jobs....
[ 74%] Linking CXX executable PE_SYNCHRONIZATION
[ 74%] Built target PE_SYNCHRONIZATION
[ 75%] Linking CXX executable PE_SYNCHRONIZATIONDELETE
[ 75%] Built target PE_SYNCHRONIZATIONDELETE
Makefile:138: recipe for target 'all' failed
make: *** [all] Error 2
ERROR: Job failed: exit code 1
failed
intel_17_serial_dbg Test
simd                     =   5.78 sec (6 tests)
stencil = 0.82 sec (1 test)

Total Test time (real) = 57.16 sec

The following tests FAILED:
97 - PE_RAYTRACING (Failed)
Errors while running CTest
ERROR: Job failed: exit code 1
failed
gcc_6_hybrid_dbg_sp Test
[ 87%] Linking CXX executable PeriodicParticleChannelMEM
[ 87%] Linking CXX executable DragForceSphereMEMRefinement
[ 87%] Built target PeriodicParticleChannelMEM
[ 87%] Built target DragForceSphereMEMRefinement
[ 87%] Linking CXX executable DragForceSpherePSMRefinement
[ 87%] Built target DragForceSpherePSMRefinement
Makefile:140: recipe for target 'all' failed
make: *** [all] Error 2
ERROR: Job failed: exit code 1
failed
gcc_6_serial_dbg Test
[ 77%] Linking CXX executable PE_HCSITS
[ 77%] Built target PE_HCSITS
[ 77%] Linking CXX executable PE_MARSHALLING
[ 77%] Built target PE_MARSHALLING
[ 77%] Linking CXX executable PE_COLLISION
[ 77%] Built target PE_COLLISION
Makefile:140: recipe for target 'all' failed
make: *** [all] Error 2
ERROR: Job failed: exit code 1