Changes from RRZE testfront

34 jobs for master in 168 minutes and 42 seconds (queued for 2 seconds)
latest
Status Job ID Name Coverage
  Pretest
passed #341031
docker
clang_9.0_hybrid_dbg_sp

00:18:41

passed #341030
docker
gcc_9_hybrid

00:41:39

 
  Test
passed #341054
docker
clang-tidy

00:04:27

passed #341047
docker
clang_4.0_hybrid_dbg

00:16:01

passed #341048
docker
clang_9.0_hybrid

00:14:26

passed #341051
docker
clang_9.0_hybrid_dbg

00:20:56

passed #341050
docker
clang_9.0_mpionly_dbg

00:19:43

passed #341049
docker
clang_9.0_serial_dbg

00:14:40

passed #341053
docker
doc

00:01:15

failed #341040
docker cuda
gcc_5_hybrid_dbg

00:03:13

failed #341041
docker cuda
gcc_7_hybrid

00:07:54

failed #341042
docker cuda
gcc_7_serial_dbg

00:03:22

passed #341052
docker
gcc_8_hybrid_dbg_noboost

00:30:51

passed #341045
docker
gcc_9_hybrid_dbg

00:34:45

passed #341046
docker
gcc_9_hybrid_dbg_sp

00:39:50

passed #341044
docker
gcc_9_mpionly_dbg

00:04:15

passed #341043
docker
gcc_9_serial_dbg

01:08:15

passed #341032
intel docker
intel_17_hybrid_dbg

02:07:03

failed #341033
intel docker cuda
intel_18_hybrid

00:03:40

failed #341034
intel docker cuda
intel_18_serial_dbg

00:12:56

passed #341035
intel docker
intel_19_hybrid

01:07:38

passed #341038
intel docker
intel_19_hybrid_dbg

01:00:24

passed #341039
intel docker
intel_19_hybrid_dbg_sp

01:13:40

passed #341037
intel docker
intel_19_mpionly_dbg

01:58:42

passed #341036
intel docker
intel_19_serial_dbg

00:37:50

failed #341063
mac
mac_MpiOnly

00:24:51

failed #341062
mac
mac_MpiOnly_Dbg

00:28:33

failed #341061
mac
mac_Serial

00:22:29

failed #341060
mac
mac_Serial_Dbg

00:28:28

failed #341057
win
msvc-14.2_Hybrid

00:26:14

failed #341055
win
msvc-14.2_Hybrid_Dbg

00:42:06

failed #341056
win
msvc-14.2_Hybrid_SP_Dbg

00:37:45

failed #341059
win
msvc-14.2_MpiOnly_Dbg

00:35:17

failed #341058
win
msvc-14.2_Serial_Dbg

00:34:57

 
Name Stage Failure
failed
msvc-14.2_MpiOnly_Dbg Test
  TimerTest.vcxproj -> C:\cygwin64\home\build\builds\bauer\walberla\build\tests\core\DebugOptimized\TimerTest.exe
Building Custom Rule C:/cygwin64/home/build/builds/bauer/walberla/tests/core/CMakeLists.txt
CMake does not need to re-run because C:/cygwin64/home/build/builds/bauer/walberla/build/tests/core/CMakeFiles/generate.stamp is up-to-date.
VariantTest.vcxproj -> C:\cygwin64\home\build\builds\bauer\walberla\build\tests\core\DebugOptimized\VariantTest.exe
VersionTest.cpp
TimingTreeTest.vcxproj -> C:\cygwin64\home\build\builds\bauer\walberla\build\tests\core\DebugOptimized\TimingTreeTest.exe
VersionTest.vcxproj -> C:\cygwin64\home\build\builds\bauer\walberla\build\tests\core\DebugOptimized\VersionTest.exe
SchaeferTurek.vcxproj -> C:\cygwin64\home\build\builds\bauer\walberla\build\apps\benchmarks\SchaeferTurek\DebugOptimized\SchaeferTurek.exe
ERROR: Job failed: Process exited with status 1
failed
msvc-14.2_Serial_Dbg Test
  Unknown compiler version - please run the configure tests and report the results
AVX_SSE2_Equivalence.vcxproj -> C:\cygwin64\home\build\builds\bauer\walberla\build\tests\simd\DebugOptimized\AVX_SSE2_Equivalence.exe
Unknown compiler version - please run the configure tests and report the results
AVX_SSE4_Equivalence.vcxproj -> C:\cygwin64\home\build\builds\bauer\walberla\build\tests\simd\DebugOptimized\AVX_SSE4_Equivalence.exe
AccuracyEvaluationTest.vcxproj -> C:\cygwin64\home\build\builds\bauer\walberla\build\tests\field\DebugOptimized\AccuracyEvaluationTest.exe
AVX2_AVX_Equivalence.vcxproj -> C:\cygwin64\home\build\builds\bauer\walberla\build\tests\simd\DebugOptimized\AVX2_AVX_Equivalence.exe
02_Tutorial_Sweeps.vcxproj -> C:\cygwin64\home\build\builds\bauer\walberla\build\apps\tutorials\basics\DebugOptimized\02_Tutorial_Sweeps.exe
03_HeatEquation_Extensions.vcxproj -> C:\cygwin64\home\build\builds\bauer\walberla\build\apps\tutorials\pde\DebugOptimized\03_HeatEquation_Extensions.exe
ERROR: Job failed: Process exited with status 1
failed
msvc-14.2_Hybrid Test
  Building Custom Rule C:/cygwin64/home/build/builds/bauer/walberla/tests/mesa_pd/CMakeLists.txt
CMake does not need to re-run because C:/cygwin64/home/build/builds/bauer/walberla/build/tests/mesa_pd/CMakeFiles/generate.stamp is up-to-date.
AnalyticCollisionFunctions.cpp
MESA_PD_Domain_DistanceCalculation.vcxproj -> C:\cygwin64\home\build\builds\bauer\walberla\build\tests\mesa_pd\Release\MESA_PD_Domain_DistanceCalculation.exe
MESA_PD_COLLISIONDETECTION_EPA.vcxproj -> C:\cygwin64\home\build\builds\bauer\walberla\build\tests\mesa_pd\Release\MESA_PD_COLLISIONDETECTION_EPA.exe
MESA_PD_COLLISIONDETECTION_GJKEPA.vcxproj -> C:\cygwin64\home\build\builds\bauer\walberla\build\tests\mesa_pd\Release\MESA_PD_COLLISIONDETECTION_GJKEPA.exe
MESA_PD_Data_LinkedCells.vcxproj -> C:\cygwin64\home\build\builds\bauer\walberla\build\tests\mesa_pd\Release\MESA_PD_Data_LinkedCells.exe
MESA_PD_COLLISIONDETECTION_AnalyticCollisionFunctions.vcxproj -> C:\cygwin64\home\build\builds\bauer\walberla\build\tests\mesa_pd\Release\MESA_PD_COLLISIONDETECTION_AnalyticCollisionFunctions.exe
ERROR: Job failed: Process exited with status 1
failed
msvc-14.2_Hybrid_SP_Dbg Test
  Unknown compiler version - please run the configure tests and report the results
TimerTest.vcxproj -> C:\cygwin64\home\build\builds\bauer\walberla\build\tests\core\DebugOptimized\TimerTest.exe
TimingPoolTest.vcxproj -> C:\cygwin64\home\build\builds\bauer\walberla\build\tests\core\DebugOptimized\TimingPoolTest.exe
TimingTreeTest.vcxproj -> C:\cygwin64\home\build\builds\bauer\walberla\build\tests\core\DebugOptimized\TimingTreeTest.exe
UNIQUEID.vcxproj -> C:\cygwin64\home\build\builds\bauer\walberla\build\tests\core\DebugOptimized\UNIQUEID.exe
VersionTest.vcxproj -> C:\cygwin64\home\build\builds\bauer\walberla\build\tests\core\DebugOptimized\VersionTest.exe
VariantTest.vcxproj -> C:\cygwin64\home\build\builds\bauer\walberla\build\tests\core\DebugOptimized\VariantTest.exe
SchaeferTurek.vcxproj -> C:\cygwin64\home\build\builds\bauer\walberla\build\apps\benchmarks\SchaeferTurek\DebugOptimized\SchaeferTurek.exe
ERROR: Job failed: Process exited with status 1
failed
msvc-14.2_Hybrid_Dbg Test
  TimingTreeTest.vcxproj -> C:\cygwin64\home\build\builds\bauer\walberla\build\tests\core\DebugOptimized\TimingTreeTest.exe
MESA_PD_COLLISIONDETECTION_EllipsoidSupport.vcxproj -> C:\cygwin64\home\build\builds\bauer\walberla\build\tests\mesa_pd\DebugOptimized\MESA_PD_COLLISIONDETECTION_EllipsoidSupport.exe
MESA_PD_COLLISIONDETECTION_AnalyticContactDetection.vcxproj -> C:\cygwin64\home\build\builds\bauer\walberla\build\tests\mesa_pd\DebugOptimized\MESA_PD_COLLISIONDETECTION_AnalyticContactDetection.exe
01_MESA_PD.vcxproj -> C:\cygwin64\home\build\builds\bauer\walberla\build\apps\tutorials\mesa_pd\DebugOptimized\01_MESA_PD.exe
MESA_PD_COLLISIONDETECTION_BoxSupport.vcxproj -> C:\cygwin64\home\build\builds\bauer\walberla\build\tests\mesa_pd\DebugOptimized\MESA_PD_COLLISIONDETECTION_BoxSupport.exe
MPIGatherSchemeTest.vcxproj -> C:\cygwin64\home\build\builds\bauer\walberla\build\tests\gather\DebugOptimized\MPIGatherSchemeTest.exe
GatherSchemeTest.vcxproj -> C:\cygwin64\home\build\builds\bauer\walberla\build\tests\gather\DebugOptimized\GatherSchemeTest.exe
CurveGatherTest.vcxproj -> C:\cygwin64\home\build\builds\bauer\walberla\build\tests\gather\DebugOptimized\CurveGatherTest.exe
ERROR: Job failed: Process exited with status 1
failed
mac_MpiOnly_Dbg Test
                            ^
/Users/testaccounticp/builds/bauer/walberla/tests/cuda/communication/GPUPackInfoCommunicationTest.cpp:70:13: note: in instantiation of function template specialization 'std::__1::make_shared<walberla::cuda::HostFieldAllocator<unsigned long, 0>>' requested here
make_shared<cuda::HostFieldAllocator< DataType > >() // allocator for host pinned memory
^
3 errors generated.
make[2]: *** [tests/cuda/CMakeFiles/GPUPackInfoCommunicationTest.dir/communication/GPUPackInfoCommunicationTest.cpp.o] Error 1
make[1]: *** [tests/cuda/CMakeFiles/GPUPackInfoCommunicationTest.dir/all] Error 2
make: *** [all] Error 2
ERROR: Job failed: Process exited with status 1
failed
mac_Serial_Dbg Test
                            ^
/Users/testaccounticp/builds/bauer/walberla/tests/cuda/communication/GPUPackInfoCommunicationTest.cpp:70:13: note: in instantiation of function template specialization 'std::__1::make_shared<walberla::cuda::HostFieldAllocator<unsigned long, 0>>' requested here
make_shared<cuda::HostFieldAllocator< DataType > >() // allocator for host pinned memory
^
3 errors generated.
make[2]: *** [tests/cuda/CMakeFiles/GPUPackInfoCommunicationTest.dir/communication/GPUPackInfoCommunicationTest.cpp.o] Error 1
make[1]: *** [tests/cuda/CMakeFiles/GPUPackInfoCommunicationTest.dir/all] Error 2
make: *** [all] Error 2
ERROR: Job failed: Process exited with status 1
failed
mac_MpiOnly Test
                            ^
/Users/testaccounticp/builds/bauer/walberla/tests/cuda/communication/GPUPackInfoCommunicationTest.cpp:70:13: note: in instantiation of function template specialization 'std::__1::make_shared<walberla::cuda::HostFieldAllocator<unsigned long, 0>>' requested here
make_shared<cuda::HostFieldAllocator< DataType > >() // allocator for host pinned memory
^
3 errors generated.
make[2]: *** [tests/cuda/CMakeFiles/GPUPackInfoCommunicationTest.dir/communication/GPUPackInfoCommunicationTest.cpp.o] Error 1
make[1]: *** [tests/cuda/CMakeFiles/GPUPackInfoCommunicationTest.dir/all] Error 2
make: *** [all] Error 2
ERROR: Job failed: Process exited with status 1
failed
mac_Serial Test
                            ^
/Users/testaccounticp/builds/bauer/walberla/tests/cuda/communication/GPUPackInfoCommunicationTest.cpp:70:13: note: in instantiation of function template specialization 'std::__1::make_shared<walberla::cuda::HostFieldAllocator<unsigned long, 0>>' requested here
make_shared<cuda::HostFieldAllocator< DataType > >() // allocator for host pinned memory
^
3 errors generated.
make[2]: *** [tests/cuda/CMakeFiles/GPUPackInfoCommunicationTest.dir/communication/GPUPackInfoCommunicationTest.cpp.o] Error 1
make[1]: *** [tests/cuda/CMakeFiles/GPUPackInfoCommunicationTest.dir/all] Error 2
make: *** [all] Error 2
ERROR: Job failed: Process exited with status 1
failed
intel_18_serial_dbg Test
[ 43%] Built target GPUPackInfoTest
[ 43%] Built target SimpleKernelTest
[ 43%] Linking CXX executable CudaMPI
[ 43%] Linking CXX executable AllHeaderTest
[ 43%] Built target CudaMPI
[ 43%] Built target AllHeaderTest
make: *** [all] Error 2
Makefile:140: recipe for target 'all' failed
ERROR: Job failed: exit code 1
failed
gcc_7_hybrid Test
[ 44%] Linking CXX executable FftTest
[ 44%] Built target FftTest
[ 45%] Linking CXX executable GreensTest
[ 45%] Built target GreensTest
[ 45%] Linking CXX executable AllHeaderTest
[ 45%] Built target AllHeaderTest
make: *** [all] Error 2
Makefile:140: recipe for target 'all' failed
ERROR: Job failed: exit code 1
failed
gcc_7_serial_dbg Test
[ 53%] Linking CXX executable SimpleKernelTest
[ 53%] Built target PeriodicIntersect
[ 53%] Built target SimpleKernelTest
[ 53%] Built target CudaMPI
[ 53%] Linking CXX executable AllHeaderTest
[ 53%] Built target AllHeaderTest
Makefile:140: recipe for target 'all' failed
make: *** [all] Error 2
ERROR: Job failed: exit code 1
failed
intel_18_hybrid Test
[ 62%] Linking CXX executable BinaryRawFileTest
[ 62%] Built target BinaryRawFileTest
[ 62%] Linking CXX executable FieldInterpolationTest
[ 62%] Built target FieldInterpolationTest
[ 62%] Linking CXX executable VoxelFileTest
[ 62%] Built target VoxelFileTest
make: *** [all] Error 2
Makefile:140: recipe for target 'all' failed
ERROR: Job failed: exit code 1
failed
gcc_5_hybrid_dbg Test
[ 42%] Built target SimpleKernelTest
[ 42%] Built target AllHeaderTest
[ 43%] Linking CXX executable CudaMPI
[ 43%] Linking CXX executable PeriodicIntersect
[ 43%] Built target PeriodicIntersect
[ 43%] Built target CudaMPI
make: *** [all] Error 2
Makefile:138: recipe for target 'all' failed
ERROR: Job failed: exit code 1