Merge branch 'SmallFixes' into 'master'

Fix setup dependency

Closes #22

See merge request !96
14 jobs for master in 33 minutes and 11 seconds (queued for 42 seconds)
Name Stage Failure
failed
ubuntu Test
114.91s call     lbmpy_tests/phasefield/test_numerical_1D_nphase_model.ipynb::lbmpy_tests/phasefield/test_numerical_1D_nphase_model.ipynb
105.20s call lbmpy_tests/test_central_moment_transform.py::test_backward_transform[D3Q27-monomial]
====== 13 failed, 526 passed, 12 skipped, 1339 warnings in 740.23 seconds ======
Uploading artifacts for failed job
Uploading artifacts...
report.xml: found 1 matching files and directories

Uploading artifacts as "junit" to coordinator... ok
id=658373 responseStatus=201 Created token=Gh3apE88
Cleaning up project directory and file based variables
ERROR: Job failed: exit code 1

failed
latest-python Test
FAILED lbmpy_tests/test_fluctuating_lb.py::test_vectorization[False-False-False]
FAILED lbmpy_tests/test_fluctuating_lb.py::test_point_force - AssertionError
==== 13 failed, 493 passed, 44 skipped, 1143 warnings in 763.84s (0:12:43) =====
Uploading artifacts for failed job
Uploading artifacts...
report.xml: found 1 matching files and directories

Uploading artifacts as "junit" to coordinator... ok
id=658372 responseStatus=201 Created token=G7SFJRzk
Cleaning up project directory and file based variables
ERROR: Job failed: exit code 1